Quellennachweis Koch 2009
type: NamedIndividual
type: ConceptScheme

Quellennachweis Koepf / Binding 2016
type: NamedIndividual
type: ConceptScheme

Narthex
type: NamedIndividual
definition: Narthex, die mit Hürden aus Rohrgeflecht ( narthex = schilfrohrähnl. Pflanze, heute Ferula communis genannt) eingefasste Rennbahn, schließl. der für Leichenfeste angelegte Vorplatz vor Mausoleen, danach die vergitterte Vorhalle der Basilika, die anfangs genau die Form des Geheges am antiken Hippodrom und des Grabvorplatzes hatte, d. h. an beiden Enden halbkreisförmig geschlossen war. Sie diente den Büßern und Katechumenen zum Aufenthalt (Galiläa, Atrium). In der klass. byzantin. Baukunst besitzt der N. meist die Form eines schmalen Querriegels von derselben Breite wie das Kirchenschiff, mit dem er durch Türen oder Bogenstellungen verbunden ist. Befindet sich davor noch ein weiterer, zumeist durch Bogenstellungen geöffneter Vorraum, so unterscheidet man zwischen einem äußeren Exo-N. und einem inneren Eso-N„ der häufig mit Nebenkuppeln versehen ist. Die Bauform wurde vereinzelt auch im W. übernommen. [Koepf/Binding 2016]
definition: Též galilea - rajský dvůr. 1. Atrium raně křesťanské a středověké baziliky, přední dvůr obklopený sloupovými síněmi. 2. Předsíň kostela, často bohatě zdobená architektonickou plastikou, dříve se zde ukládali a žehnali mrtví předtím, než byli odneseni do kostela; nartex v byzantských chrámech se nazývá litai. [Koch 2008] @cs
definition: Galilaea, Vorkirche, Narthex, auch Vorhof, Atrium, Paradies; ummauerter, auch mit Säulengängen reich gestalteter Vorhof vor einem Kircheneingang, zumeist im W., wo sich die Ungetauften aufhalten durften, aber auch für Büßer. Schon zu den frühesten röm. Basiliken gehörig und im Verlaufe des MAs seltener. [Koepf / Binding 2016]
definition: Paradies, gleichbedeutend mit Atrium. Im 8./9. Jh. ist die Bezeichnung P. für Atrium durch den Liber Pontificalis und den Klosterplan von St. Gallen bezeugt. Zusätzl. zum Atrium werden aber auch die dreischiffigen Vorkirchen der burgund. Cluniazenserkirchen und die dreiteiligen, ein Joch tiefen Vorhallen der Zisterzienserkirchen sowie ähnl. Vorhallen an Domen, die für liturg. Prozessionen und als Grablege dienen, P. genannt, auch als Galiläa oder Narthex bezeichnet. Das zugehörige Westportal der Kirchen wird auch P.pforte genannt. [Koepf/Binding 2016]
definition: Atrium, auch Galiläa, Paradies (griech. paradeisos = Park), 1. das Atrium der altchristlichen und mittelalterlichen Basilika: von Säulenhallen umgebener Vorhof; 2. Vorhalle der Kirche, oft reich mit Bauplastik geschmückt. Früher wurden hier die Leichen niedergesetzt und gesegnet, bevor sie in die Kirche gebracht wurden. Der Narthex wird im byzantinischen Kirchenbau »Litai« genannt. [Koch 2009]
type: Concept
modified: 2021-01-22T12:40:24
in scheme: Strukturtypen
in scheme: Quellennachweis Koepf / Binding 2016
in scheme: Quellennachweis Koch 2008
in scheme: Strukturtypen für Sakralbauten
in scheme: Bamberger Vokabular für Historische Architektur
in scheme: Quellennachweis Koch 2009
preferred label: narthex @fr
preferred label: nartex @cs
preferred label: nártex @es
preferred label: nartece @it
alternative label: Paradies
alternative label: paradiso @it
alternative label: átrio @es
alternative label: Galiläa
alternative label: paradisus @fr
alternative label: paradise @en
alternative label: rajský dvůr @cs
alternative label: Galilaea
alternative label: atrium @cs
alternative label: paraíso @es
related: Atrium
broader: Vorhalle
broader: Gebäudeteil
created: 2020-08-11T12:05:03

Strukturtypen
type: NamedIndividual
type: ConceptScheme

Quellennachweis Koch 2008
type: NamedIndividual
type: ConceptScheme

Strukturtypen für Sakralbauten
type: NamedIndividual
type: ConceptScheme

Bamberger Vokabular für Historische Architektur
type: NamedIndividual
type: ConceptScheme

Atrium
type: NamedIndividual
preferred label: atrium @cs
type: Concept
related: Narthex

Vorhalle
type: NamedIndividual
preferred label: předsíň @cs
type: Concept
narrower: Narthex

Gebäudeteil
type: NamedIndividual
preferred label: část budovy @cs
type: Concept
narrower: Narthex