Quellennachweis Koch 2009
type: NamedIndividual
type: ConceptScheme

Quellennachweis Koepf / Binding 2016
type: NamedIndividual
type: ConceptScheme

architektonisches Zierelement
type: NamedIndividual
preferred label: výzdoba @cs
type: Concept
narrower: Faltwerk

Faltwerk
type: NamedIndividual
preferred label: skládaná práce @cs
definition: 1. Plošná výplň z kolmých, těsně přiléhajících záhybů, vyřezaných ze dřeva (na got. nábytku a panelech). 2. Kamenná draperie jako soklový dekor, pozdní gotika a renesance. [Koch 2008] @cs
definition: 1. Flächenfüllung aus senkrechten, enganliegenden Falten, in Holz geschnitzt (an gotischen Möbeln und Paneelen); 2. Steindraperie als Sockel-Dekoration. Spätgotik und Renaissance. [Koch 2009]
definition: Faltenförmiges, flächenfüllendes Schnitzornament an Möbeln der Spätgotik und Renaissance; auch im Innenausbau verwendet. [Koepf / Binding 2016]
created: 2020-08-05T09:31:33
in scheme: Strukturtypen
in scheme: Quellennachweis Koch 2008
in scheme: Quellennachweis Koepf / Binding 2016
in scheme: Bamberger Vokabular für Historische Architektur
in scheme: Quellennachweis Koch 2009
modified: 2021-01-25T13:44:47
broader: architektonisches Zierelement
type: Concept

Strukturtypen
type: NamedIndividual
type: ConceptScheme

Quellennachweis Koch 2008
type: NamedIndividual
type: ConceptScheme

Bamberger Vokabular für Historische Architektur
type: NamedIndividual
type: ConceptScheme