Ägyptisches Kreuz
type: NamedIndividual
preferred label: Egyptský kříž @cs
type: Concept
related: Henkelkreuz

Begriffe für den Themenkomplex Sakralbau
type: NamedIndividual
type: ConceptScheme

Kreuzform
type: NamedIndividual
type: Concept
narrower: Henkelkreuz

Quellennachweis Glossarium Artis
type: NamedIndividual
type: ConceptScheme

Quellennachweis Koch 2008
type: NamedIndividual
type: ConceptScheme

Bamberger Vokabular für Historische Architektur
type: NamedIndividual
type: ConceptScheme

Quellennachweis Koch 2009
type: NamedIndividual
type: ConceptScheme

Henkelkreuz
type: NamedIndividual
scope note: Henkel-Kreuz (crux ansata), ursprünglich ägyptisches Lebenssymbol.[Koch 2009]
in scheme: Quellennachweis Glossarium Artis
in scheme: Quellennachweis Koch 2009
in scheme: Bamberger Vokabular für Historische Architektur
in scheme: Quellennachweis Koch 2008
in scheme: Begriffe für den Themenkomplex Sakralbau
definition: Závěsný kříž (crux ansata), původně egyptský symbol života. [Koch 2008] @cs
definition: Henkelkreuz n; ägyptisches Kreuz n; auch N ilschlüssel n; lat. crux ansata: ein Tau-Kreuz, bekrönt von einem runden oder ovalen "Henkel" als Symbol für die Sonne. Es entspricht dem ägyptischen Zeichen ankh (in der ΗierogIyphenschrift = Leben), das auf Darstellungen ägyptischer Gottheiten erscheint. Das Henkelkreuz ist bei den Kopten bekannt, auch im Frühchristentum und bei den Byzantinern. [Glossarium Artis]
alternative label: handled cross @en
alternative label: Nilschlüssel
alternative label: ägyptisches Kreuz
preferred label: crux ansata @la
preferred label: ankh @en
preferred label: croix ansée @fr
preferred label: závěsný kříž @cs
created: 2019-09-11T12:29:35
modified: 2021-01-26T11:30:07
related: Ägyptisches Kreuz
type: Concept
broader: Kreuzform