Quellennachweis Koch 2009
type: NamedIndividual
type: ConceptScheme

Quellennachweis Koepf / Binding 2016
type: NamedIndividual
type: ConceptScheme

Kanneluren
type: NamedIndividual
in scheme: Quellennachweis Glossarium Artis
in scheme: Strukturtypen
in scheme: Quellennachweis Koch 2009
in scheme: Quellennachweis Koch 2008
in scheme: Bamberger Vokabular für Historische Architektur
in scheme: Quellennachweis Koepf / Binding 2016
alternative label: Kannelierung
preferred label: kanelování @cs
preferred label: flutes @en
preferred label: cannelures @fr
created: 2019-06-06T13:50:36
definition: Kannelierung (griech.-lat. canna = Rohr), Rillen = Kanneluren im antiken Säulen- oder Pfeilerschaft. Bei der dorischen Säule stoßen die Rillen in scharfen Graten aneinander, bei der ionischen und korinthischen sind sie durch Stege getrennt.[Koch 2009]
definition: Senkrechte, konkave Rillen, die in den Schaft einer Stütze eingearbeitet sind. Sie stoßen entweder scharfkantig aneinander (dorisehe Säulenordnung) oder sie sind durch Stege getrennt (ionische Säulenordnung). [Glossarium Artis]
definition: Kanneluren (gr.-lat. canna: Rohr), Kannelierung, senkrechte, konkave Rillen am Schaft eines Stützgliedes der klass. Ordnungen. Die K. können scharfkantig aneinanderstoßen (Dorische Ordnung) oder durch Stege voneinander getrennt sein (Ionische Ordnung). Bei spätantiken Ordnungen können die K. im unteren Teil des Schafts mit sog. Pfeifen gefüllt sein. [Koepf / Binding 2016]
definition: Řec.-lat. canna = trubka. Žlábky = kanelury v dříku antických sloupů a pilířů; u dórského sloupu narážejí žlábky v ostrých hranách na sebe navzájem, u iónského a korintského sloupu jsou odděleny stezkami. [Koch 2008] @cs
type: Concept
modified: 2021-01-22T17:15:05
broader: Säulenelement

Quellennachweis Glossarium Artis
type: NamedIndividual
type: ConceptScheme

Strukturtypen
type: NamedIndividual
type: ConceptScheme

Quellennachweis Koch 2008
type: NamedIndividual
type: ConceptScheme

Bamberger Vokabular für Historische Architektur
type: NamedIndividual
type: ConceptScheme

Säulenelement
type: NamedIndividual
preferred label: část sloupu @cs
type: Concept
narrower: Kanneluren