Quellennachweis Koch 2009
type: NamedIndividual
type: ConceptScheme

Quellennachweis Koepf / Binding 2016
type: NamedIndividual
type: ConceptScheme

Inkrustation (Kunsthandwerk)
type: NamedIndividual
preferred label: inkrustace (řemeslo) @cs
type: Concept
narrower: Cosmaten-Arbeit

Cosmaten-Arbeit
type: NamedIndividual
type: Concept
in scheme: Bamberger Vokabular für Historische Architektur
in scheme: Strukturtypen
in scheme: Quellennachweis Koch 2008
in scheme: Quellennachweis Koepf / Binding 2016
in scheme: Quellennachweis Koch 2009
created: 2020-08-12T11:02:48
definition: Dekorative Marmoreinlegearbeit unter Verwendung von Mosaiksteinen, Glas und Goldauflage in der ital. Baukunst des 12.-14. Jhs., an antike Vorbilder anknüpfend von den magistri cosmacini zur höchsten Pracht entfaltet. [Koepf / Binding 2016]
definition: Inkrustace mramorem této skupiny umělců 12.-14. stol. se nacházejí v Římě, Neapoli a okolí, u jejich signatur se často vyskytuje jméno Cosmas. [Koch 2008] @cs
definition: Marmorinkrustationen einer Künstlergruppe des 12.-14. Jhs. in und um Rom und Neapel, bei deren Signaturen der Name Cosmas häufig auftritt. [Koch 2009]
broader: Inkrustation (Kunsthandwerk)
preferred label: kosmaté @cs
modified: 2020-09-06T15:02:33

Bamberger Vokabular für Historische Architektur
type: NamedIndividual
type: ConceptScheme

Strukturtypen
type: NamedIndividual
type: ConceptScheme

Quellennachweis Koch 2008
type: NamedIndividual
type: ConceptScheme