Abdeckziegel
type: Concept
broader by function: Mauerziegel
broader: Mauerziegel
in scheme: Quellennachweis Schrader / Voigt 2003
in scheme: Quellennachweis Koepf / Binding 2016
in scheme: Bamberger Vokabular für Historische Architektur
in scheme: Strukturtypen
alternative label: Abdeckstein
created: 2020-01-15T14:29:40
type: NamedIndividual
definition: Jede Art von Dachziegel oder Mauerziegel, der zur Abdeckung einer Mauer verwendet wird. Von den Dachziegeln eignen sich hierzu insbesondere Biberschwanzziegel, Hohlpfannen sowie Mönch-Nonne-Ziegel, aber auch Falzdachziegel. [Schrader / Voigt 2003]
definition: Zur Abdeckung von freistehenden Mauern als Backsteine (Rollschicht), Dachsteine, Formsteine oder Betonplatten zum Schutz gegen das Eindringen von Niederschlägen in die Stoßfugen des Mauerwerks. [Koepf / Binding 2016]
modified: 2021-01-26T16:36:10

Quellennachweis Schrader / Voigt 2003
type: NamedIndividual
type: ConceptScheme

Quellennachweis Koepf / Binding 2016
type: NamedIndividual
type: ConceptScheme

Bamberger Vokabular für Historische Architektur
type: NamedIndividual
type: ConceptScheme

Strukturtypen
type: NamedIndividual
type: ConceptScheme

Mauerziegel
type: NamedIndividual
preferred label: tuile @fr
preferred label: teja @es
preferred label: tegola @it
preferred label: brick @en
type: Concept
narrower: Abdeckziegel