Begriffe für den Themenkomplex Sakralbau
type: NamedIndividual
type: ConceptScheme

Titulus
type: NamedIndividual
modified: 2021-01-22T11:26:44
preferred label: inscription of the cross @en
preferred label: titre de la croix @fr
preferred label: titulus @la
created: 2020-08-10T15:33:18
definition: Titulus m (lat.); präzis. Kreuztitulus m: eine Tafel über dem Haupt des Gekreuzigten, meist mit der Inschrift INRI (Jesus Nazarenus Rex Judaeorum (Joh 19,19). [Glossarium Artis]
definition: Inschrift auf einer Tafel oder Platte, dann wegen der Tafel mit Angaben des Besitzers über dem Hauseingang Bezeichnung für frühchristl. Gemeindehäuser in Rom, im 4. Jh. auf die dort errichteten Basiliken übertragen mit gleichzeitigem Austausch der Besitzernamen gegen Heiligennarnen, später allg. der Weihe-T., d.h. die auf den Namen eines HI. vollzogene Weihe der Kirche. [Koepf / Binding 2016]
in scheme: Quellennachweis Glossarium Artis
in scheme: Begriffe für den Themenkomplex Sakralbau
in scheme: Bamberger Vokabular für Historische Architektur
alternative label: Kreuztitulus
alternative label: title of the cross @en
broader: Kruzifixelement
type: Concept

Quellennachweis Glossarium Artis
type: NamedIndividual
type: ConceptScheme

Bamberger Vokabular für Historische Architektur
type: NamedIndividual
type: ConceptScheme

Kruzifixelement
type: NamedIndividual
type: Concept
narrower: Titulus