Quellennachweis Koepf / Binding 2016
type: NamedIndividual
type: ConceptScheme

Strukturtypen
type: NamedIndividual
type: ConceptScheme

Quellennachweis Koch 2008
type: NamedIndividual
type: ConceptScheme

Brunnen
type: NamedIndividual
preferred label: spring, well, fountain @en
preferred label: puits, fontaine @fr
preferred label: pozzo, fontana @it
preferred label: pozo, fuente @es
preferred label: kašna @cs
type: Concept
narrower: Nymphäum

Nymphäum
type: NamedIndividual
preferred label: nymfeum @cs
modified: 2020-09-16T11:47:43
definition: Na místech pramenů nebo rozvodů vody přicházející z akvaduktu stavěli Římané často mohutné objekty, tzv.: nymfa (řec. nymfaion), zasvěcená nymfám. [Koch 2008] @cs
definition: Kultplatz der Nymphen, urspr. über einer Quelle, später aber hauptsächl. an der Mündung einer Wasserleitung in der Stadt. In der hellenist. und röm. Kunst sind Nymphaeen mehrgeschossige Säulenarchitekturen, vor denen Wasserbassins liegen, auch tempelähnl. Anlagen oder Zentralbauten, Blickfang an wichtigen Plätzen oder Straßenecken. Im 16. Jh. in Rom wiederaufgenommen und über Europa verbreitet, als Nymphenbäder in die dt. Lustschlossparks übernommen, in der 2. Hälfte des 18. Jhs. im Landschaftsgarten von bes. Bedeutung. [Koepf/Binding 2016]
in scheme: Quellennachweis Koch 2008
in scheme: Bamberger Vokabular für Historische Architektur
in scheme: Strukturtypen
in scheme: Quellennachweis Koepf / Binding 2016
broader: Brunnen
created: 2020-08-03T16:18:26
type: Concept
alternative label: nymfea @cs

Bamberger Vokabular für Historische Architektur
type: NamedIndividual
type: ConceptScheme