Quellennachweis Koepf / Binding 2016
type: NamedIndividual
type: ConceptScheme

Fensterelement
type: NamedIndividual
preferred label: část okna @cs
type: Concept
narrower: Sohlbank

Strukturtypen
type: NamedIndividual
type: ConceptScheme

Sohlbank
type: Concept
preferred label: solera de la ventana @es
preferred label: window sill @en
preferred label: okenní parapet @cs
preferred label: banquette @fr
preferred label: davanzale @it
broader: Fensterelement
broader: Öffnungselement
alternative label: appui de fenêtre @fr
alternative label: Fensterbank
narrower: Fensterbrett
modified: 2021-01-22T16:35:07
type: NamedIndividual
definition: Untere waagerechte Begrenzung der Fensteröffnung. [Noky 1996]
definition: Spodní vodorovná plocha ostění obou typů. [Koch 2008] @cs
definition: Fensterbank, 1. Sohlbank, untere Begrenzung des Fensters; 2. Sitzbank in einer Fensternische. [Koepf / Binding 2016]
definition: Fensterbank, unterer Abschluss eines Fensters, meist aus Stein. Die S. muss nach vorne geneigt sein, über das Mauerwerk überstehen und eine Wassernase erhalten, am hinteren Ende läuft ein Falz, auf dem der Fensterrahmen aufsitzt. Innen wird die S. durch das Fensterbrett abgedeckt. [Koepf / Binding 2016]
in scheme: Bamberger Vokabular für Historische Architektur
in scheme: Quellennachweis Koepf / Binding 2016
in scheme: Quellennachweis Koch 2008
in scheme: Strukturtypen
created: 2019-06-13T16:42:27

Öffnungselement
type: NamedIndividual
type: Concept
narrower: Sohlbank

Fensterbrett
type: NamedIndividual
preferred label: poprsní deska @cs
type: Concept
broader: Sohlbank

Bamberger Vokabular für Historische Architektur
type: NamedIndividual
type: ConceptScheme

Quellennachweis Koch 2008
type: NamedIndividual
type: ConceptScheme