Strukturtypen für Burgen und Schlösser
type: NamedIndividual
type: ConceptScheme

Strukturtypen
type: NamedIndividual
type: ConceptScheme

Burg
type: NamedIndividual
preferred label: hrad @cs
type: Concept
narrower: Hangburg

Hangburg
type: NamedIndividual
scope note: Eine am Hang eines Berges angelegte Burg.
in scheme: Strukturtypen für Burgen und Schlösser
in scheme: Quellennachweis Wörterbuch der Burgen, Schlösser und Festungen
in scheme: Strukturtypen
in scheme: Bamberger Vokabular für Historische Architektur
broader: Burg
type: Concept
definition: Viele Burgen wurden nicht unmittelbar auf der Höhe eines Bergrückens oder Berggipfels ( Gipfelburg, Höhenburg) angelegt, sondern auf halbem Hang, so dass sie vom ansteigenden Gelände überhöht wurden. Häufig nutzte man als Bauplatz eine weniger steile Hangpartie oder eine natürliche Terrasse (Bergvorsprung), die dann oft künstlich erweitert wurde. Der stark eingeschränkte Baugrund zwang oft zu unregelmäßigen Architekturformen. Zur Bergseite hin sind H.en mehrfach durch Schildmauern (Ehrenfels HE, Burgschwalbach RP) oder durch einen Turm (Sooneck RP) geschützt. Mehrere Burgen an den Steilhängen von Flusstälern (Rhein, Mosel, Lahn, Neckar) oder an Gebirgszügen wurden während des Hoch- und Spätmittelalters als H.en gebaut, wobei die Unterscheidung von Spornburgen und Burgen auf Felsrippen oft nicht leicht fällt. H. W. B. [Wörterbuch der Burgen, Schlösser und Festungen]
modified: 2021-01-27T10:53:25
created: 2019-08-19T14:38:54
broader by position: Burg

Quellennachweis Wörterbuch der Burgen, Schlösser und Festungen
type: NamedIndividual
type: ConceptScheme

Bamberger Vokabular für Historische Architektur
type: NamedIndividual
type: ConceptScheme