Quellennachweis Koch 2009
type: NamedIndividual
type: ConceptScheme

Quellennachweis Koepf / Binding 2016
type: NamedIndividual
type: ConceptScheme

Dach
type: NamedIndividual
preferred label: střecha @cs
type: Concept
narrower: Zwerchdach

Strukturtypen
type: NamedIndividual
type: ConceptScheme

Zwerchhaus
type: NamedIndividual
preferred label: vikýř s obytným prostorem @cs
type: Concept
related: Zwerchdach

Quellennachweis Eißing et al. 2012
type: NamedIndividual
type: ConceptScheme

Zwerchdach
type: Concept
type: NamedIndividual
preferred label: boční stříška @cs
created: 2019-05-18T12:32:32
definition: Zwerchdach, 1. Lukarne. 2. Querdach, ein senkrecht zum Hauptdach ausgerichtetes, kleineres Dach, bes. bei got. Seitenschiffen verwandt, wo über jedem Joch ein Walm- oder Satteldach aufsitzt und sich damit eine Reihung ergibt, auch vereinzelt angewandt, dort auch als Ziergiebel. [Koepf / Binding 2016]
definition: Querdach, quer zum Hauptfirst verlaufendes Dach, z.B. beim Zwerchhaus. [Koch 2009]
definition: Ein Dachaufbau in Flucht der Traufwand, dessen First quer zum First des Hauptdaches verläuft, heißt Querdach oder Zwerchdach. Liegt seine Traufe oberhalb der Traufe des Hauptdaches, so dass eine Seitenwand ausgebildet wird, spricht man vom Zwerchhaus. [Eißing et al. 2012]
definition: Vikýřová stříška procházející napříč k hlavnímu hřebenu střechy, např. u zastřešeného vikýře s obytným prostorem. [Koch 2008] @cs
broader: Dach
in scheme: Quellennachweis Koch 2009
in scheme: Strukturtypen
in scheme: Quellennachweis Koepf / Binding 2016
in scheme: Bamberger Vokabular für Historische Architektur
in scheme: Quellennachweis Koch 2008
in scheme: Quellennachweis Eißing et al. 2012
modified: 2020-12-01T14:35:58
related: Zwerchhaus
alternative label: nižší příčná střecha se štítem u okapu sedlové střechy @cs
broader by position: Dach

Bamberger Vokabular für Historische Architektur
type: NamedIndividual
type: ConceptScheme

Quellennachweis Koch 2008
type: NamedIndividual
type: ConceptScheme