Quellennachweis Koch 2009
type: NamedIndividual
type: ConceptScheme

Quellennachweis Koepf / Binding 2016
type: NamedIndividual
type: ConceptScheme

Strukturtypen
type: NamedIndividual
type: ConceptScheme

Strukturtypen für Sakralbauten
type: NamedIndividual
type: ConceptScheme

Quellennachweis Koch 2008
type: NamedIndividual
type: ConceptScheme

Bamberger Vokabular für Historische Architektur
type: NamedIndividual
type: ConceptScheme

Lady Chapel
definition: Lady Chapel, der Maria geweihte und nach außen vorstehende Scheitelkapelle am Ostende einer engl. Kathedrale. [Koepf / Binding 2016]
definition: Lady Chapel (engl. Kapelle Unserer Lieben Frau), Marienkapelle in englischen Kathedralen, meist mit rechteckigem Grundriss und meist an den Scheitel des Ostchores angesetzt (Scheitelkapelle). [Koch 2009]
definition: Lady Chapel, angl. kaple Macky boží), kaple P. Marie v anglických katedrálách, většinou obdélníkového půdorysu, většinou v závěru východního chóru (kaple v závěru chóru, Salisbury). [Koch 2008] @cs
broader by function: Scheitelkapelle
modified: 2021-01-22T12:13:52
in scheme: Quellennachweis Koch 2009
in scheme: Strukturtypen für Sakralbauten
in scheme: Bamberger Vokabular für Historische Architektur
in scheme: Strukturtypen
in scheme: Quellennachweis Koepf / Binding 2016
in scheme: Quellennachweis Koch 2008
broader: Scheitelkapelle
created: 2020-07-23T12:58:16
type: NamedIndividual
type: Concept

Scheitelkapelle
preferred label: retrochoir @en
preferred label: kaple v ose chóru @cs
preferred label: chapelle terminale @fr
preferred label: capilla saliente @es
type: NamedIndividual
type: Concept
narrower: Lady Chapel