Quellennachweis Koepf / Binding 2016
type: NamedIndividual
type: ConceptScheme

Quellennachweis Schrader / Voigt 2003
type: NamedIndividual
type: ConceptScheme

Abfallrohr
definition: Hohlkörper mit rundem oder eckigem Querschnitt zur Abführung von Abwasser, aus Holz oder Gusseisen, aber auch aus Keramik. [Schrader / Voigt 2003]
definition: Hohlkörper mit rundem oder rechteckigem Querschnitt aus Holz, Gusseisen oder Keramik zur Abführung von Abwasser, auch vom Dach. [Koepf / Binding 2016]
definition: Fallrohr, Abfallrohr, zur Entwässerung der Dachfläche an die Dachrinne angeschlossene Röhre zur Ableitung des Wassers. [Koepf / Binding 2016]
created: 2020-01-15T15:00:54
type: Concept
type: NamedIndividual
preferred label: odpadní trubka @cs
in scheme: Bamberger Vokabular für Historische Architektur
in scheme: Strukturtypen
in scheme: Quellennachweis Koepf / Binding 2016
in scheme: Quellennachweis Schrader / Voigt 2003
broader: Entwässerungselement
modified: 2020-09-08T15:05:38
alternative label: Fallrohr

Strukturtypen
type: NamedIndividual
type: ConceptScheme

Bamberger Vokabular für Historische Architektur
type: NamedIndividual
type: ConceptScheme

Entwässerungselement
type: NamedIndividual
type: Concept
narrower: Abfallrohr