Quellennachweis Koch 2009
type: NamedIndividual
type: ConceptScheme

Begriffe für den Themenkomplex Sakralbau
type: NamedIndividual
type: ConceptScheme

Gotischer Schwung
created: 2020-08-07T12:07:45
preferred label: gotické zakřivení @cs
in scheme: Begriffe für den Themenkomplex Sakralbau
in scheme: Bamberger Vokabular für Historische Architektur
in scheme: Quellennachweis Koch 2009
in scheme: Quellennachweis Koch 2008
broader: Ponderation
type: Concept
type: NamedIndividual
modified: 2021-01-15T18:01:23
definition: Im Unterschied zum Kontrapost sind seit dem 13, Jh. bei vielen gotischen Figuren die waagerechten Achsen (Becken, Schultern) nicht gegen-, sondern gleichsinnig verschoben. Der Kopf ist der erhöhten Schulter zugeneigt. So ergibt sich eine S-Krümmung, die die steigende Körperbewegung (im Sinne des gotischen Bauwillens) betont. [Koch 2009]
definition: Na rozdíl od kontrapostu jsou od 13. stol. u četných gotických postav posunuty vodorovné osy (pánev, ramena) nikoliv v protilehlém, nýbrž ve stejném směru. Hlava je skloněna ke zvýšenému ramenu. Tak vzniká zakřivení v podobě písmene S, které zvýrazňuje stoupající pohyb těla (ve smyslu gotického stavebního záměru). [Koch 2008] @cs

Ponderation
preferred label: ponderace @cs
type: NamedIndividual
type: Concept
narrower: Gotischer Schwung

Quellennachweis Koch 2008
type: NamedIndividual
type: ConceptScheme

Bamberger Vokabular für Historische Architektur
type: NamedIndividual
type: ConceptScheme