Gebäudeensemble
type: NamedIndividual
type: Concept
narrower: Stadtkern

Stadtkern
preferred label: centro (della città) @it
preferred label: centro urbano @es
preferred label: noyau urbain @fr
preferred label: centrum města, městské jádro @cs
preferred label: city centre @en
preferred label: city center @en-us
definition: City (engl.), vom Namen der Innenstadt Londons abgeleitete Bezeichnung für den Stadtkern, bes. bei Ballung von Geschäfts- und Verwaltungsfunktionen. [Koepf / Binding 2016]
definition: Innenstadt, Zentrum einer Stadt. Der S. ist bei europ. Städten meist der ehemals von Mauern, Gräben und Wällen umgebene Teil (Altstadt), im weiteren Sinne des Worts auch das Zentrum mit den Hauptgeschäftsstraßen und öffentl.Gebäuden (City) im Gegensatz zu den Außenbezirken bzw. Vorstädten. [Koepf / Binding 2016]
created: 2020-08-14T16:17:11
in scheme: Bamberger Vokabular für Historische Architektur
in scheme: Strukturtypen
in scheme: Quellennachweis Koepf / Binding 2016
in scheme: Strukturtypen für Geländephänomene und Infrastruktur
type: NamedIndividual
type: Concept
modified: 2021-01-27T15:42:54
alternative label: City @en
alternative label: centre-ville @fr
broader: Gebäudeensemble

Quellennachweis Koepf / Binding 2016
type: NamedIndividual
type: ConceptScheme

Strukturtypen
type: NamedIndividual
type: ConceptScheme

Bamberger Vokabular für Historische Architektur
type: NamedIndividual
type: ConceptScheme

Strukturtypen für Geländephänomene und Infrastruktur
type: NamedIndividual
type: ConceptScheme