Quellennachweis Koch 2009
type: NamedIndividual
type: ConceptScheme

Strukturtypen
type: NamedIndividual
type: ConceptScheme

Stahlskelettbau
preferred label: steel-frame construction @en
preferred label: ocelová skeletová konstrukce @cs
preferred label: costruzione a scheletro d\'acciaio @it
preferred label: construction à ossature en acier @fr
preferred label: construcción con estructura metálica @es
type: NamedIndividual
type: Concept
broader: Skelettbau

Quellennachweis Koch 2008
type: NamedIndividual
type: ConceptScheme

Bamberger Vokabular für Historische Architektur
type: NamedIndividual
type: ConceptScheme

Strebewerk
preferred label: étanconnage @fr
preferred label: opěrný systém @cs
preferred label: contraffortatura @it
preferred label: buttressing @en
preferred label: contrafuerte @es
type: NamedIndividual
type: Concept
broader: Skelettbau

Baukonstruktionsgefüge
preferred label: stavební konstrukce @cs
type: NamedIndividual
type: Concept
narrower: Skelettbau

Skelettbau
in scheme: Bamberger Vokabular für Historische Architektur
in scheme: Quellennachweis Koch 2009
in scheme: Strukturtypen
in scheme: Quellennachweis Koch 2008
preferred label: construcción con estructura de entramado @es
preferred label: skeletová konstrukce @cs
preferred label: skeleton construction @en
preferred label: costruzione con struttura a scheletro @it
preferred label: construction en ossature (portante) @fr
narrower: Strebewerk
narrower: Stahlskelettbau
modified: 2020-11-27T15:06:38
broader: Baukonstruktionsgefüge
alternative label: skeletová stavba @cs
type: Concept
type: NamedIndividual
definition: Způsob stavby sestávající z kostry ze dřeva (hrázděné zdivo), kamene (např. opěrný systém), oceli nebo železobetonu nad konstrukční sítí - rastrem. Skelet přebírá všechny nosné funkce, jeho tvar je proto určován statickými silami. Může - podobně jako gotický opěrný systém být zvenčí viditelný, nebo zakrytý samonosnou, resp. zavěšenou fasádou. Racionálním využitím statických zákonitostí umožňuje skeletová konstrukce mj. ekonomické využití stavebního materiálu. [Koch 2008] @cs
definition: Bauweise aus einem Gerippe von Holz (Fachwerk), Stein (z.B. Strebewerk), Stahl oder Stahlbeton über einem Rastersystem. Das Skelett übernimmt alle Tragefunktionen, seine Form wird deshalb von den statischen Kräften bestimmt. Es kann - wie das gotische Strebewerk - außen sichtbar bleiben oder durch eine selbsttragende bzw. eine Vorhang-Fassade verdeckt werden. Der Skelettbau bezweckt u.a. ökonomischen Materialeinsatz durch weitestgehende rationelle Ausnutzung der statischen Gesetze. [Koch 2009]
definition: Gerippebau, eine Bauweise, bei der im Gegensatz zum Massivbau alle tragenden Funktionen auf ein System tragfähiger Glieder, für die der Kräfteverlauf formbildend und maßgebend ist (Skelett), beschränkt werden. Die Funktionen des Raumabschlusses werden gegebenenfalls von nichttragenden Füllungen übernommen. Als Material eignen sich Holz (Fachwerkbau), Stahl, Stein (Strebewerk) und Stahlbeton. Das Skelett kann außen sichtbar sein (wie z.B. bei den got. Kathedralen) oder von einer meist vorgehängten Fassade verdeckt werden (Vorhangfassade). Allen S.ten liegen Rastersysteme zugrunde. [Koepf / Binding 2016]
created: 2020-08-11T17:41:45