Quellennachweis Noky 1996
type: NamedIndividual
type: ConceptScheme

Doppelreiber
type: NamedIndividual
type: Concept
broader: Reiber

Strukturtypen
type: NamedIndividual
type: ConceptScheme

Quellennachweis Pax - Fenster & Türen Fachbegriffe
type: NamedIndividual
type: ConceptScheme

Bamberger Vokabular für Historische Architektur
type: NamedIndividual
type: ConceptScheme

Reiber
created: 2019-06-12T18:24:02
in scheme: Bamberger Vokabular für Historische Architektur
in scheme: Quellennachweis Noky 1996
in scheme: Strukturtypen
in scheme: Quellennachweis Pax - Fenster & Türen Fachbegriffe
definition: (Halbvorreiber oder Doppelvorreiber) aufgeschraubter oder genagelter Drehriegel, der die Flügel am Blendrahmen über einen Streichdraht oder ein Streichblech festriegelt. [Pax - Fenster & Türen Fachbegriffe]
definition: Neben der Ankettel älteste bekannte Fensterverriegelung. Drehbar innen am Fensterrahmen befestigte Verriegelung, die den Fensterflügel an den Rahmen drückt. [Noky 1996]
definition: Vorreiber, Fensterbeschlag; drehbarer Griff zur Verriegelung der Fensterflügel, bes. zur Betätigung des senkrechten Stabs, dessen gebogene Enden in untere und obere Ösen eindrehen. [Koepf/Binding 2016]
preferred label: perilla de ventana @es
preferred label: maniglia di finestra @it
preferred label: frottoir @fr
narrower: Einreiber
narrower: Doppelreiber
modified: 2021-01-22T14:42:07
type: NamedIndividual
type: Concept
broader: Fensterverriegelung
alternative label: Vorreiber

Fensterverriegelung
preferred label: okenní zámek @cs
type: NamedIndividual
type: Concept
narrower: Reiber

Einreiber
type: NamedIndividual
type: Concept
broader: Reiber