Quellennachweis Koch 2009
type: NamedIndividual
type: ConceptScheme

Quellennachweis Koepf / Binding 2016
type: NamedIndividual
type: ConceptScheme

Kreuzgewölbe
preferred label: voûte d\'arêtes @fr
preferred label: křížová klenba @cs
preferred label: cross vault @en
type: NamedIndividual
type: Concept
narrower: Kreuzrippengewölbe

Strukturtypen
type: NamedIndividual
type: ConceptScheme

Knickrippengewölbe
preferred label: voûte à nervures brisées @fr
preferred label: broken rib vault @en
type: NamedIndividual
type: Concept
broader by shape: Kreuzrippengewölbe
broader: Kreuzrippengewölbe

Strukturtypen für Sakralbauten
type: NamedIndividual
type: ConceptScheme

Quellennachweis Glossarium Artis
type: NamedIndividual
type: ConceptScheme

Quellennachweis Koch 2008
type: NamedIndividual
type: ConceptScheme

Bamberger Vokabular für Historische Architektur
type: NamedIndividual
type: ConceptScheme

Rippengewölbe
preferred label: žebrová klenba @cs
preferred label: voûte à nervures @fr
preferred label: volta a costoloni @it
preferred label: rib vault @en
preferred label: bóveda nervada @es
type: NamedIndividual
type: Concept
narrower: Kreuzrippengewölbe

Quellennachweis Wörterbuch der Burgen, Schlösser und Festungen
type: NamedIndividual
type: ConceptScheme

Kreuzrippengewölbe
in scheme: Quellennachweis Koch 2008
in scheme: Bamberger Vokabular für Historische Architektur
in scheme: Quellennachweis Koch 2009
in scheme: Quellennachweis Wörterbuch der Burgen, Schlösser und Festungen
in scheme: Strukturtypen
in scheme: Quellennachweis Glossarium Artis
in scheme: Strukturtypen für Sakralbauten
in scheme: Quellennachweis Koepf / Binding 2016
preferred label: žebrová křížová klenba @cs
preferred label: voûte f d\'ogives @fr
preferred label: ribbed cross vault @en
alternative label: voûte sur croisée d\'ogives @fr
alternative label: cross-ribbed vault @en
alternative label: Diagonalrippengewölbe
modified: 2021-01-19T12:48:50
definition: Beim Kreuzrippengewölbe werden zunächst an der Stelle der Grate Rippen gespannt, die in den verschiedenen Stilepochen unterschiedliche Profile zeigen. Sie tragen die Last und führen sie in die Pfeiler ab. Die Kappen bestehen aus leichtem Mauerwerk (z.B. Lohstein). [Koch 2009]
definition: Ein Gewölbe, bei dem die Grate des Kreuzgewölbes durch Rippen verstärkt sind. B. Sch.-W. [Wörterbuch der Burgen, Schlösser und Festungen]
definition: Kreuzgewölbe mit tragenden Rippen und zwischengespannten Kappen. Den günstigen statischen Wert des spitzbogigen Kreuzrippengewölbes - die Gewölbelasten werden durch Rippen auf die Auflagerpunkte übertragen - und die bei ihm gegebenen Variationsmöglichkeiten zum Überdecken aller Raumformen erkannte man frühzeitig in der l le-de-France und in Burgund. Der Reichtum an formalen Möglichkeiten ließ das spitzbogige Kreuzgewölbe zum wichtigsten raumgestaltenden Element der mittelalterlichen Architektur werden. Zu unterscheiden vom Diagonalrippengewölbe als Ziergewölbe. [Glossarium Artis]
definition: Má místo hran žebra, která mívala v různých slohových epochách různý profil, žebra nesou zatížení a přenášejí je na pilíře, kápě jsou vyzděny (např. tříslovými cihlami). [Koch 2008] @cs
definition: Kreuzgewölbe mit unterlegten Rippen. [Koepf / Binding 2016]
created: 2019-02-18T23:18:51
broader: Rippengewölbe
broader: Kreuzgewölbe
broader by shape: Kreuzgewölbe
type: NamedIndividual
type: Concept
narrower: Dominikalgewölbe
narrower: Knickrippengewölbe

Dominikalgewölbe
type: NamedIndividual
type: Concept
broader: Kreuzrippengewölbe