Quellennachweis Koch 2009
type: NamedIndividual
type: ConceptScheme

Quellennachweis Koepf / Binding 2016
type: NamedIndividual
type: ConceptScheme

Strukturtypen
type: NamedIndividual
type: ConceptScheme

Piano nobile
type: NamedIndividual
type: Concept
in scheme: Strukturtypen
in scheme: Quellennachweis Koepf / Binding 2016
in scheme: Quellennachweis Koch 2008
in scheme: Quellennachweis Wörterbuch der Burgen, Schlösser und Festungen
in scheme: Bamberger Vokabular für Historische Architektur
in scheme: Quellennachweis Koch 2009
definition: Piano nobile n (ital.), auch Beletage, Hauptgeschoss in einem größeren Gebäude bzw. im Schloss. Das P. n. befindet sich im Allgemeinen im ersten Obergeschoss, selten im zweiten. Im 18. Jh. ist es aber auch möglich, dass es im Erdgeschoss liegt, besonders bei Lustschlössern. Über Fenstertüren kann dann der Garten zum erweiterten Nutzungsraum des Gebäudes werden. H. L. [Wörterbuch der Burgen, Schlösser und Festungen]
definition: Beletage (frz. schönes Stockwerk), das Hauptgeschoss eines Gebäudes (Geschoss) mit den Repräsentationsräumen, meist über dem Erdgeschoss. [Koepf / Binding 2016]
definition: Beletage (frz. schönes Geschoss), Piano nobile, Geschoss, in dem sich die Repräsentationsräume befinden, meist 1. Obergeschoss. Seit Barock. [Koch 2009]
definition: Franc. krásné podlaží, též piano nobile. Podlaží s reprezentačními prostorami, většinou v 1. patře, od baroka. [Koch 2008] @cs
definition: Beletage, Hauptgeschoss eines größeren Gebäudes.[Koepf/Binding 2016]
broader: Geschoss
alternative label: Beletage
alternative label: beletáž @cs
alternative label: Hauptgeschoss
preferred label: piano nobile @cs
broader by function: Geschoss
created: 2020-06-15T15:51:40
modified: 2021-01-12T17:56:04

Quellennachweis Koch 2008
type: NamedIndividual
type: ConceptScheme

Bamberger Vokabular für Historische Architektur
type: NamedIndividual
type: ConceptScheme

Quellennachweis Wörterbuch der Burgen, Schlösser und Festungen
type: NamedIndividual
type: ConceptScheme

Geschoss
type: NamedIndividual
type: Concept
narrower: Piano nobile