Quellennachweis Koch 2009
type: NamedIndividual
type: ConceptScheme

Strukturtypen für Burgen und Schlösser
type: NamedIndividual
type: ConceptScheme

Strukturtypen
type: NamedIndividual
type: ConceptScheme

Quellennachweis Koch 2008
type: NamedIndividual
type: ConceptScheme

Quellennachweis Wörterbuch der Burgen, Schlösser und Festungen
type: NamedIndividual
type: ConceptScheme

Bamberger Vokabular für Historische Architektur
type: NamedIndividual
type: ConceptScheme

Wehr- und Schutzanlage
preferred label: opevnění @cs
type: NamedIndividual
type: Concept
narrower: Kasematte

Kasematte
in scheme: Quellennachweis Koch 2008
in scheme: Bamberger Vokabular für Historische Architektur
in scheme: Quellennachweis Koch 2009
in scheme: Strukturtypen für Burgen und Schlösser
in scheme: Quellennachweis Wörterbuch der Burgen, Schlösser und Festungen
in scheme: Strukturtypen
definition: (frz.-ital.), Verschiedene, in der Regel gemauerte, mit einer bombensicheren Decke versehene Hohlbauten/-räume. Ab dem 16. Jh. aufkommende Verteidigungs-K.n dienten zur gesicherten Gefechtsaufstellung von Infanterie oder Artillerie, Wohn-K.n zur Unterkunft der Besatzung, Bereitschafts-K.n zum Aufenthalt in Bereitschaft befindlicher Mannschaften, Vorrats-K.n als Depots. Im 19. Jh. kam es zu weiteren Differenzierungen von K.n. Bildet eine Eskarpenmauer (Eskarpe) die Stirnseite, so dient die K. auch zu ihrer Entlastung vom Bodendruck (Dechargen-K.) und zur frontalen Verteidigung des Grabens. Bei den so genannten K.-Korps (z. B. Kriegskasernen nach 1870 erbauter detachierter Werke / Forts) erhielten die K.n an der Außenwand Fenster (mit Stahlblechläden); rückseitig lag ein Verbindungskorridor, der, da eingemantelt künstlich beleuchtet und ventiliert, den Anschluss an weitere Kommunikationswege herstellte (Treppenhäuser bei mehrstöckigen K.n-Korps: Kehlkasernements bei Forts, Kasernen in Kavalieren der Stadtbefestigung). Bei der Marine des 19. und frühen 20. Jh.s bezeichnete K. einen durch Panzerwände geschützten Raum zur Aufstellung von Geschützen, mit denen durch Pforten oder über Bank gefeuert wurde. M. L. [Wörterbuch der Burgen, Schlösser und Festungen]
definition: Überwölbte Schutzräume einer befestigten Anlage für Besatzung, Geschütze und Munition. [Koch 2009]
definition: Zaklenuté obranné prostory opevněného objektu určené pro posádku, děla a munici. [Koch 2008] @cs
broader: Wehr- und Schutzanlage
preferred label: kasematy @cs
modified: 2021-01-18T15:07:30
type: Concept
type: NamedIndividual
created: 2020-07-27T13:54:55