Quellennachweis Koch 2009
type: NamedIndividual
type: ConceptScheme

Quellennachweis Koepf / Binding 2016
type: NamedIndividual
type: ConceptScheme

Erker
preferred label: arkýř @cs
type: NamedIndividual
type: Concept
narrower: Auslucht

Strukturtypen
type: NamedIndividual
type: ConceptScheme

Bamberger Vokabular für Historische Architektur
type: NamedIndividual
type: ConceptScheme

Auslucht
definition: Besonders an den Wohnhäusern der niedersächsischen Renaissance üblicher erkerartiger Vorbau des Erdgeschosses oder mehrerer Geschosse an einer oder beiden Seiten der Haustür. [Koch 2009]
definition: 1. Auch Utlucht, an Renaissancebauten Niedersachsens ein vom Erdboden aufsteigender, meist mehrgeschossiger, erkerartiger Vorbau an einer oder zu beiden Seiten der Haustüre. 2. Über einem Seitenschiffjoch errichteter Querdachgiebel, bes. an got. Kirchen Ostdeutschlands (Lucht). [Koepf / Binding 2016]
preferred label: arkýřový výstupek @cs
in scheme: Strukturtypen
in scheme: Quellennachweis Koch 2009
in scheme: Bamberger Vokabular für Historische Architektur
in scheme: Quellennachweis Koepf / Binding 2016
created: 2020-08-03T13:34:57
type: NamedIndividual
type: Concept
modified: 2021-01-22T12:27:12
broader: Erker
alternative label: Utlucht