Quellennachweis Koch 2009
type: NamedIndividual
type: ConceptScheme

Begriffe für den Themenkomplex Sakralbau
type: NamedIndividual
type: ConceptScheme

Bildinhalt der christlichen Ikonographie
preferred label: iconographie chrétienne @fr
preferred label: Christian iconography @en
type: NamedIndividual
type: Concept
narrower: Palmesel

Quellennachweis Koch 2008
type: NamedIndividual
type: ConceptScheme

Bamberger Vokabular für Historische Architektur
type: NamedIndividual
type: ConceptScheme

Palmesel
broader: Bildinhalt der christlichen Ikonographie
type: NamedIndividual
type: Concept
preferred label: velikonoční oslátko @cs
in scheme: Quellennachweis Koch 2009
in scheme: Begriffe für den Themenkomplex Sakralbau
in scheme: Bamberger Vokabular für Historische Architektur
in scheme: Quellennachweis Koch 2008
definition: Podvozek s dřevěným oslíkem, na němž sedí figura Krista v životní velikosti se žehnajícím gestem, od středověku součást procesí o Květné neděli, aby připomínalo Kristův příchod do Jeruzaléma (Matouš). [Koch 2008] @cs
definition: Fahrgestell mit einem hölzernen Esel, auf dem eine lebensgroße Christusfigur mit segnender Gebärde sitzt. Wird seit dem Mittelalter in der Palmsonntagsprozession mitgeführt zur Erinnerung an Christi Einzug in Jerusalem (Matthäus, 21,1-11). [Koch 2009]
modified: 2021-01-23T12:40:41
created: 2020-08-11T11:53:40