Quellennachweis Koch 2009
type: NamedIndividual
type: ConceptScheme

Historismus
preferred label: historismus @cs
type: NamedIndividual
type: Concept
narrower: Rundbogenstil

Begriffe für den Themenkomplex Sakralbau
type: NamedIndividual
type: ConceptScheme

Rundbogenstil
broader: Historismus
created: 2020-08-11T17:06:00
preferred label: rundbogenstil @cs
definition: Projev německého historismu s byzantskými architektonickými prvky a prvky italského románského slohu a renesance; na počátku stál K. F. Schinkel, L. Persius (Berlín), zvl. rozšířen v Mnichově (Ludwigskirche, F. v. Gartner; nádraží, F. Biirklein), Karlsruhe (H. Hiibsch, F. Eisenlohr), Hannoveru (C. W. Hase}; vlivy patrné ještě i na stuttgartském nádraží, 1912-31, P. Bonatz. [Koch 2008] @cs
definition: Erscheinungsform des deutschen Historismus mit byzantinischen Bauformen und Elementen der italienischen Romanik und Renaissance. Ursprünge bei K. F. Schinkel, L. Persius (Berlin); besonders verbreitet in München (Ludwigskirche, F. v. Gärtner; Bahnhof, F. Bürklein), Karlsruhe (H. Hübsch, F. Eisenlohr), Hannover (C. W. Hase). Nachwirkungen bis zum Stuttgarter Bahnhof, 1912-31, P. Bonatz. [Koch 2009]
type: Concept
type: NamedIndividual
modified: 2021-01-15T18:22:23
in scheme: Quellennachweis Koch 2008
in scheme: Bamberger Vokabular für Historische Architektur
in scheme: Begriffe für den Themenkomplex Sakralbau
in scheme: Quellennachweis Koch 2009

Quellennachweis Koch 2008
type: NamedIndividual
type: ConceptScheme

Bamberger Vokabular für Historische Architektur
type: NamedIndividual
type: ConceptScheme