Quellennachweis Koch 2009
type: NamedIndividual
type: ConceptScheme

Quellennachweis Koepf / Binding 2016
type: NamedIndividual
type: ConceptScheme

Strukturtypen
type: NamedIndividual
type: ConceptScheme

Wasserspeier
definition: Vyústění okapu vystupující ze střechy, které chrání zdivo před vlhkostí; v antickém chrámu v podobě lví hlavy, v gotice jako groteskní figury (zvířata, lidé, bájné bytosti), jejichž symbolický význam dnes již často nelze vyložit. [Koch 2008] @cs
definition: Vom Dach vorspringende Regenablaufrinne, die das Mauerwerk vor Nässe schützt. Am antiken Tempel als Löwenkopf, in der Gotik als skurrile Figuren (Tiere, Menschen, Fabelwesen), deren Symbolwerte heute oft nicht mehr zu deuten sind. [Koch 2009]
definition: Abtraufe, Ansetztraufe; wasserabführendes Rohr aus Blech oder Stein an einer Rinnleiste, oft in figürl. Ausschmückung als Tier, Drache, Mensch, so bes. an Tempeln und got. Kathedralen, falls keine Abfallrohre der Dachrinne vorhanden sind. [Koepf / Binding 2016]
in scheme: Bamberger Vokabular für Historische Architektur
in scheme: Quellennachweis Koch 2008
in scheme: Quellennachweis Koepf / Binding 2016
in scheme: Strukturtypen
in scheme: Quellennachweis Koch 2009
preferred label: gargouille @fr
preferred label: doccione @it
preferred label: gárgola @es
preferred label: chrlič @cs
preferred label: gargoyle @en
type: Concept
type: NamedIndividual
alternative label: dešt\'ové vody @cs
created: 2020-07-10T16:05:14
broader: Entwässerungselement
modified: 2020-12-01T10:36:14

Quellennachweis Koch 2008
type: NamedIndividual
type: ConceptScheme

Bamberger Vokabular für Historische Architektur
type: NamedIndividual
type: ConceptScheme

Entwässerungselement
type: NamedIndividual
type: Concept
narrower: Wasserspeier