Quellennachweis Koch 2009
type: NamedIndividual
type: ConceptScheme

architektonisches Zierelement
preferred label: výzdoba @cs
type: NamedIndividual
type: Concept
narrower: Verkröpfung

Strukturtypen
type: NamedIndividual
type: ConceptScheme

Strukturtypen für Sakralbauten
type: NamedIndividual
type: ConceptScheme

Quellennachweis Koch 2008
type: NamedIndividual
type: ConceptScheme

Bamberger Vokabular für Historische Architektur
type: NamedIndividual
type: ConceptScheme

Gesims
preferred label: římsa @cs
type: NamedIndividual
type: Concept
related: Verkröpfung

Verkröpfung
in scheme: Strukturtypen für Sakralbauten
in scheme: Quellennachweis Koch 2009
in scheme: Strukturtypen
in scheme: Quellennachweis Koch 2008
in scheme: Bamberger Vokabular für Historische Architektur
alternative label: recoupement @fr
alternative label: ripiegatura @it
type: NamedIndividual
type: Concept
preferred label: risalto @it
preferred label: zalomení @cs
preferred label: acodadura @es
preferred label: crossette @fr
broader: architektonisches Zierelement
created: 2020-02-11T16:25:38
definition: Kröpfung, Vorziehen eines Gebälks samt Fries und Gesims, eines Gesimses u. dergl. über einem vorstehenden Bauteil (Wandsäule, Wandpfeiler, Pilaster, Mauervorsprung u. dergl.). Die vorstehende Kante des verkröpften Elements heißt Kropfkante. Der Höhe nach Verkröpfen wird aufkröpfen genannt. [Koepf / Binding 2016]
definition: Zalomená (lomená) je římsa vedená celým svým profilem klikatě kolem výstupků ve zdi = zalomení. [Koch 2008] @cs
definition: Zalomení z vodorovné do svislé polohy nazýváme svislé zalomení. [Koch 2008] @cs
definition: Gesims. Die Verkröpfung aus der Waagerechten in die Senkrechte nennt man Aufkröpfung. [Koch 2009]
related: Gesims
modified: 2021-01-26T14:22:53