Quellennachweis Koch 2009
type: NamedIndividual
type: ConceptScheme

Quellennachweis Koepf / Binding 2016
type: NamedIndividual
type: ConceptScheme

Strukturtypen
type: NamedIndividual
type: ConceptScheme

Terrasse
preferred label: terrazza @it
preferred label: terraza @es
preferred label: terrasse @fr
preferred label: terrace @en
preferred label: terasa @cs
type: NamedIndividual
type: Concept
narrower: Beischlag

Strukturtypen für Wohn- und Nutzbauten
type: NamedIndividual
type: ConceptScheme

Quellennachweis Koch 2008
type: NamedIndividual
type: ConceptScheme

Bamberger Vokabular für Historische Architektur
type: NamedIndividual
type: ConceptScheme

Beischlag
type: Concept
type: NamedIndividual
in scheme: Quellennachweis Koch 2009
in scheme: Bamberger Vokabular für Historische Architektur
in scheme: Strukturtypen für Wohn- und Nutzbauten
in scheme: Quellennachweis Koch 2008
in scheme: Quellennachweis Koepf / Binding 2016
in scheme: Strukturtypen
preferred label: zápraží @cs
definition: Als Sitze ausgebildete Wangen der drei- bis vierstufigen Freitreppe vor dem städt. Wohnhaus in Norddeutschland, Ostseeraum, Schweiz, Niederlanden, Böhmen, seit Ende des 14. Jhs. urkundl. nachgewiesen, im 15. Jh. voll ausgebildet mit hohen, stelenartigen Pfosten an der Stirnseite, zur Straße hin mit Reliefs verziert. [Koepf / Binding 2016]
definition: Terrasse mit Brüstung und Freitreppe in der ganzen Frontbreite des Hauses an der Straßenseite. Ersetzt im Ostseeraum den Garten des Stadthauses und schützt Erdgeschoss und Hauseingang mit Diele vor Überschwemmungen. [Koch 2009]
definition: Terasa se zábradlím a venkovním schodištěm po celé šíři čela domu na uliční straně. V Pobaltí, zvl. v Gdaňsku nahradilo zahradu městského domu a chránilo přízemí a vchod do domu před záplavami. [Koch 2008] @cs
modified: 2021-01-27T01:11:12
broader: Terrasse
created: 2020-08-03T14:59:38