Sammlung
preferred label: sbírka @cs
type: NamedIndividual
type: Concept
narrower: Kunst- und Wunderkammer

Kunst- und Wunderkammer
broader by function: Sammlung
modified: 2021-01-26T10:48:32
created: 2020-06-23T09:36:50
in scheme: Bamberger Vokabular für Historische Architektur
broader: Sammlung
definition: Sammlungstyp der frühen Neuzeit, der sich aus kirchlichen und fürstlichen Schätzen entwickelte, die auch Reliquien enthielten. Die Universalität des Sammelns umfasste Kostbarkeiten, Kunstwerke und Naturalien (Pflanzen, Tiere, Steine, Muscheln und Kunsthandwerk). Während für kleinere Sammlungen Kunstkammerschränke ausreichten, wurden für die größeren eigene Räume eingerichtet, die häufig wegen des kostbaren Inhalts besonders geschützt lagen, z. B. in Türmen. Später entwickelten sich daraus Kunst-Kabinette. Besondere K.- u. W.n legten Kaiser Ferdinand II. in Schloss Ambras und Kaiser Rudolf II. in Prag an. B. Sch.-W. [Wörterbuch der Burgen, Schlösser und Festungen]
type: NamedIndividual
type: Concept

Bamberger Vokabular für Historische Architektur
type: NamedIndividual
type: ConceptScheme