Quellennachweis Koch 2009
type: NamedIndividual
type: ConceptScheme

Quellennachweis Koepf / Binding 2016
type: NamedIndividual
type: ConceptScheme

Kapelle (Bauteil)
preferred label: kaple @cs
type: NamedIndividual
type: Concept
narrower: Doppelkapelle

Unterkirche
preferred label: église inférieure @fr
preferred label: lower church @en
preferred label: iglesia inferior @es
preferred label: dolní prostor dvojitého kostela nebo kaple @cs
preferred label: chiesa inferiore @it
type: NamedIndividual
type: Concept
related: Doppelkapelle

Strukturtypen
type: NamedIndividual
type: ConceptScheme

Strukturtypen für Sakralbauten
type: NamedIndividual
type: ConceptScheme

Quellennachweis Koch 2008
type: NamedIndividual
type: ConceptScheme

Bamberger Vokabular für Historische Architektur
type: NamedIndividual
type: ConceptScheme

Doppelkapelle
in scheme: Bamberger Vokabular für Historische Architektur
in scheme: Strukturtypen für Sakralbauten
in scheme: Quellennachweis Koepf / Binding 2016
in scheme: Quellennachweis Koch 2008
in scheme: Quellennachweis Koch 2009
in scheme: Strukturtypen
type: NamedIndividual
type: Concept
preferred label: two-storey chapel @en
preferred label: capillas superpuestas @es
preferred label: chapelle à deux doubles étages @fr
preferred label: cappella ad ambienti sovrapposti @it
preferred label: dvoupatrová kaple @cs
definition: Doppelkapelle, bei Pfalzen und Burgen des Mittelalters zwei übereinanderliegende Kapellen, meist durch eine mittlere Öffnung miteinander verbunden, jede mit einem eigenen Eingang versehen. Die obere Kapelle, vereinzelt mit Empore, war für die Herrschaft und ihr Gefolge, die untere für das Gesinde oder als Grablege bestimmt. Häufigste Form der D. ist die Vierstützen-D. mit geöffnetem Mitteljoch; eine andere Gruppe bilden die ein- oder mehrräumigen Rechteckbauten mit mittlerer Öffnung, 11.-12. Jh. im dt. Sprachraum. [Koepf / Binding 2016]
definition: Dvojitý kostel, do 12./13. stol. spojení dvou kaplí nad sebou, zvláště u fald a hradů, dolní kaple sloužila jako presbytář a pro čeleď, v horní kapli měl proti apsidě místo panovník, otvor v podlaze umožňoval průhled z panské části na oltář v přízemí. [Koch 2008] @cs
definition: Leitet sich von der Kapelle der Aachener Pfalz NW ab und findet sich deshalb besonders in kaiserlichem oder fürstlichem Umfeld. In einer D. liegen zwei Kulträume mit eigenen Altären übereinander im gleichen Gebäude, die – zumindest in Deutschland – durch eine Öffnung miteinander verbunden sind. Charakteristisch war die D. mit vier Stützen, wie sie sich in der Pfalz zu Eger CZ und auf der Nürnberger Burg BY erhalten hat. Bei diesen verband eine quadratische und in beiden Geschossen von vier Stützen umstandene Öffnung die beiden Geschosse. Sie war aber auch Bestandteil bischöflicher Paläste (Mainz RP, Speyer RP, Köln NW). Im französischen Burgenbau ist die doppelgeschossige Palastkapelle ohne verbindenden Raumschacht verbreitet, für die das prächtigste Beispiel die Sainte Chapelle in Paris F ist. B. Sch.-W. [Wörterbuch der Burgen, Schlösser und Festungen]
definition: Doppelkirche, bis zum 12./13. Jh. vorkommende Verbindung zweier übereinanderliegender Kapellen, besonders in Pfalzen und Burgen; die untere als Altarraum und fürs Gesinde, die obere mit Herrschersitz gegenüber der Apsis. Eine Öffnung im Fußboden erlaubt den Durchblick vom Herrensitz zum Altar. [Koch 2009]
broader by shape: Kapelle (Gebäude)
broader by shape: Kapelle (Bauteil)
alternative label: patrová kaple @cs
created: 2019-02-18T21:21:10
broader: Kapelle (Bauteil)
broader: Kapelle (Gebäude)
modified: 2021-01-22T12:35:07
related: Unterkirche

Kapelle (Gebäude)
type: NamedIndividual
type: Concept
narrower: Doppelkapelle