Quellennachweis Koch 2009
type: NamedIndividual
type: ConceptScheme

Quellennachweis Koch 2008
type: NamedIndividual
type: ConceptScheme

Keramik
preferred label: keramika @cs
preferred label: ceramic @en
type: NamedIndividual
type: Concept
narrower: Porzellan

Bamberger Vokabular für Historische Architektur
type: NamedIndividual
type: ConceptScheme

Porzellan
type: Concept
type: NamedIndividual
definition: Ital. porcellana = porcelánový šnek, z lat. porcellus = selátko. Z kaolinu a živce a s glazurou z podobného materiálu. Často je malovaný: a)malba pod polevou před druhým výpalem (vysoká trvanlivost. Je možná pouze u některých podpolevových barev, např. kobaltu - cibulový vzor!), b)malba na polevě vpálená při slabém třetím výpalu (nižší trvanlivost, avšak bohatší paleta). [Koch 2008] @cs
definition: Porzellan (ital. porcellana = Porzellanschnecke von lat. porcellus = Schweinchen) aus Kaolin und Feldspat und einer Glasur aus ähnlicher Masse. Häufig bemalt: 1. Unterglasurrnalerei vor dem zweiten Brand (haltbarer, aber nur mit den wenigen Scharffeuerfarben möglich, z.B. Kobalt [Zwiebelmuster!]); 2. Aufglasurmalerei durch schwachen dritten Brand eingebrannt (weniger haltbar, aber reichere Palette). [Koch 2009]
in scheme: Quellennachweis Koch 2009
in scheme: Quellennachweis Koch 2008
in scheme: Bamberger Vokabular für Historische Architektur
created: 2020-08-06T10:28:53
preferred label: porcelán @cs
modified: 2020-08-24T10:17:59
broader: Keramik