Begriffe für Naturstein- und Wandmalereirestaurierung
type: NamedIndividual
type: ConceptScheme

Quellennachweis ICOMOS-ISCS
type: NamedIndividual
type: ConceptScheme

Verfärbung
preferred label: změna barvy @cs
preferred label: discolouration @en
preferred label: altération chromatique @fr
type: NamedIndividual
type: Concept
narrower: Färbung

Färbung
in scheme: Begriffe für Bauerhalt
in scheme: Bamberger Vokabular für Historische Architektur
in scheme: Begriffe für Naturstein- und Wandmalereirestaurierung
in scheme: Quellennachweis ICOMOS-ISCS
type: Concept
type: NamedIndividual
preferred label: zbarvení @cs
preferred label: coloration @fr
preferred label: colouration @en
definition: Färbung ist eine Veränderung in Farbwert, Helligkeit und/oder eine Zunahme der Farbsättigung. [ICOMOS-ISCS]
definition: Changement de teinte, de clarté et /ou à un gain en saturation. changement de teinte, de clarté et /ou à un gain en saturation. changement de teinte, de clarté et /ou à un gain en saturation. [ICOMOS-ISCS] @fr
definition: Change in hue,value and/or a gain in chroma [ICOMOS-ISCS] @en
definition: Změna v odstínu, nebo zabarvení, světlosti barvy nebo barva získá sytost. [ICOMOS-ISCS] @cs
alternative label: zabarvování @cs
alternative label: colouring @en
created: 2019-11-07T12:47:50
broader: Verfärbung
modified: 2021-01-30T17:40:49

Begriffe für Bauerhalt
type: NamedIndividual
type: ConceptScheme

Bamberger Vokabular für Historische Architektur
type: NamedIndividual
type: ConceptScheme