partielle Festigung mit KSE
type: NamedIndividual
type: Concept
broader: Festigung

Restaurierung
type: NamedIndividual
type: Concept
narrower: Festigung

Begriffe für Bauerhalt
type: NamedIndividual
type: ConceptScheme

Quellennachweis EwaGlos
type: NamedIndividual
type: ConceptScheme

Festigung
preferred label: consolidation @fr
preferred label: consolidare @ro
preferred label: konsolidacija @hr
preferred label: konsolidacja @pl
preferred label: consolidamento @it
preferred label: Укрепване @bg
preferred label: sağlamlaştırma @tr
preferred label: consolidación @es
preferred label: szilárdítás @hu
in scheme: Quellennachweis EwaGlos
in scheme: Bamberger Vokabular für Historische Architektur
in scheme: Begriffe für Bauerhalt
modified: 2021-03-19T14:51:33
alternative label: megerősítés @hu
alternative label: Консолидация @bg
alternative label: Konsolidierung
definition: Eine Maßnahme, die den Verlust von mechanischer Festigkeit wiederherstellen und die innere Kohäsion der verschiedenen Schichten eines Kunstwerks verbessern soll. Dazu werden adhäsive Substanzen durch Tränkung oder Injektion in die Poren und Hohlräume des Gefüges oder Materials eingebracht. (EwaGlos)
definition: Vise a retablir la perte de resistance mecanique, a augmenter la cohesion interne entre les differentes couches constitutives d’un bien culturel, par application, impregnation ou injection de produits adherant dans les vides de la structure ou du materiau. (EwaGlos) @fr
definition: Procedure aimed at re-establishing the loss of mechanical strength and improving the internal cohesion of different layers that make up an artwork. It is performed via the application, by impregnation or injection, of adhesive products within the voids of the structure or material. (EwaGlos) @en
type: Concept
type: NamedIndividual
created: 2019-05-08T19:57:46
narrower: partielle Festigung mit KSE
broader: Restaurierung

Bamberger Vokabular für Historische Architektur
type: NamedIndividual
type: ConceptScheme