Quellennachweis Koch 2009
type: NamedIndividual
type: ConceptScheme

Strukturtypen
type: NamedIndividual
type: ConceptScheme

Steinguss
type: Concept
type: NamedIndividual
preferred label: kamenolit @cs
preferred label: scultura a stampo @it
preferred label: casting of imitated stone @en
preferred label: fundición de piedra @es
definition: Beim Steinguss wird ein Bildwerk aus pulverisiertem (meist Kalk-)Stein gegossen, so z.B. in der (süddeutschen) Spätgotik. [Koch 2009]
definition: Guss von Bauteilen (Gewölberippen etc.) und Bildhauerarbeiten aus einer Masse aus Steinmehl und Bindemittel in Negativformen, v.a. um 1400 verbreitet. [Koepf / Binding 2016]
definition: V případě kamenolitu se socha odlévá z práškového kamene (většinou vápence), např. v (jihoněmecké) pozdní gotice. [Koch 2008] @cs
modified: 2020-11-02T16:44:52
broader: Kunst- & Handwerkserzeugnis
in scheme: Quellennachweis Koch 2008
in scheme: Bamberger Vokabular für Historische Architektur
in scheme: Quellennachweis Koch 2009
in scheme: Strukturtypen
alternative label: piedra colada @es
alternative label: stucco @it
created: 2020-08-03T15:26:16

Quellennachweis Koch 2008
type: NamedIndividual
type: ConceptScheme

Kunst- & Handwerkserzeugnis
type: NamedIndividual
type: Concept
narrower: Steinguss

Bamberger Vokabular für Historische Architektur
type: NamedIndividual
type: ConceptScheme