Quellennachweis Koch 2009
type: NamedIndividual
type: ConceptScheme

Symmetrie
preferred label: symétrie @fr
preferred label: symmetry @en
preferred label: symetrie @cs
preferred label: simmetria @it
preferred label: simetria @es
type: NamedIndividual
type: Concept
narrower: Optische Ergänzung

Begriffe für den Themenkomplex Sakralbau
type: NamedIndividual
type: ConceptScheme

Quellennachweis Koch 2008
type: NamedIndividual
type: ConceptScheme

Bamberger Vokabular für Historische Architektur
type: NamedIndividual
type: ConceptScheme

Optische Ergänzung
preferred label: optické doplnění @cs
modified: 2021-01-15T18:05:42
in scheme: Quellennachweis Koch 2009
in scheme: Quellennachweis Koch 2008
in scheme: Bamberger Vokabular für Historische Architektur
in scheme: Begriffe für den Themenkomplex Sakralbau
definition: Eigenart des Rokoko, bei der paarige Kunstwerke (z.B. Seitenaltäre) nicht - wie etwa noch im Barock - in sich symmetrisch sind, sondern erst miteinander eine Symmetrie ergeben. Die Symmetrieachse verläuft also außerhalb des Einzelstücks und fällt mit der Achse des Gesamtraumes zusammen. [Koch 2009]
definition: Specifický rys rokoka, kdy párová umělecká díla (např. boční oltáře) nejsou, jako tomu bylo ještě v baroku, sama o sobě symetrická, nýbrž vytvářejí symetrii teprve společně; symetrická osa tak prochází mimo jednotlivé dílo a je shodná s osou celého prostoru. [Koch 2008] @cs
created: 2020-08-11T11:05:32
broader: Symmetrie
type: NamedIndividual
type: Concept