Quellennachweis Koch 2009
type: NamedIndividual
type: ConceptScheme

Traufgesims
preferred label: okapnice @cs
type: NamedIndividual
type: Concept
related: Sima

Sima
in scheme: Quellennachweis Koch 2009
in scheme: Strukturtypen
in scheme: Bamberger Vokabular für Historische Architektur
in scheme: Quellennachweis Koch 2008
definition: Traufgesims am antiken Gebälk. [Koch 2009]
definition: Rinnleiste der dor., der ion. und anderer antiker Ordnungen.[Koepf / Binding 2016]
definition: Též zvonovnice. Architektonický článek ve tvaru písmene S, tj. konkávně konvexně profilovaný; podle funkce rozlišujeme nosnou simu, nebo ukončovací simu, jako horní ukončení např. u říms, podle uspořádání rozlišujeme stoupající simu, je-li vydutá část profilu nahoře (např. u sloupových hlavic), a klesající simu, je-li vydutá část profilu dole. [Koch 2008] @cs
type: Concept
type: NamedIndividual
broader: Gebälkelement
related: Traufgesims
preferred label: sima @cs
created: 2020-08-11T17:38:27
modified: 2020-11-02T12:26:27

Strukturtypen
type: NamedIndividual
type: ConceptScheme

Gebälkelement
type: NamedIndividual
type: Concept
narrower: Sima

Quellennachweis Koch 2008
type: NamedIndividual
type: ConceptScheme

Bamberger Vokabular für Historische Architektur
type: NamedIndividual
type: ConceptScheme