Quellennachweis Koepf / Binding 2016
type: NamedIndividual
type: ConceptScheme

Bogen
preferred label: oblouk @cs
preferred label: arch @en
preferred label: arc @fr
type: NamedIndividual
type: Concept
narrower: Fensterbogen

Fensterbogen
modified: 2020-09-14T12:18:29
broader: Bogen
type: Concept
type: NamedIndividual
alternative label: arc de fenêtre @fr
preferred label: voussure @fr
preferred label: window arch @en
in scheme: Quellennachweis Glossarium Artis
in scheme: Bamberger Vokabular für Historische Architektur
in scheme: Quellennachweis Koepf / Binding 2016
in scheme: Strukturtypen
definition: Aus Wölbsteinen gemauerte Überdeckung einer Fensteröffnung. Man unterscheidet den äußeren Fensterbogen und den inneren Fensterbogen bzw. Leibungsbogen, zwischen denen der Anschlag liegt. [Glossarium Artis]
definition: 1. der obere Abschluss eines Bogenfensters. 2. An der Außenwand über einem Fenster angeordneter, vorspringender Bogen (Fensterverdachung). 3. Entlastungsbogen in der Mauer über dem Fenstersturz. [Koepf / Binding 2016]
broader by function: Bogen
created: 2019-02-18T20:28:41

Strukturtypen
type: NamedIndividual
type: ConceptScheme

Quellennachweis Glossarium Artis
type: NamedIndividual
type: ConceptScheme

Bamberger Vokabular für Historische Architektur
type: NamedIndividual
type: ConceptScheme