Quellennachweis Koch 2009
type: NamedIndividual
type: ConceptScheme

Alkoven
type: NamedIndividual
type: Concept
in scheme: Bamberger Vokabular für Historische Architektur
in scheme: Strukturtypen für Wohn- und Nutzbauten
in scheme: Quellennachweis Koepf / Binding 2016
in scheme: Quellennachweis Schrader / Voigt 2003
in scheme: Quellennachweis Koch 2008
in scheme: Strukturtypen
in scheme: Quellennachweis Koch 2009
definition: Alkoven (arab. al-qobbah = Gewölbe, das Hohle), fensterlose Raumnische, meist als Schlafstelle. [Koch 2009]
definition: Alkoven (span. alcoba, nach arab. al kubbe: das Hohle), durch eine große Wandöffnung mit dem Wohnraum verbundener, kleiner, fensterloser Nebenraum, in dem das Bett steht. Die aus dem arab. Wohnhaus stammende Anordnung kam über Spanien, wie der Name, seit der Mitte des 17. Jhs. in fast allen europ. Ländern in Gebrauch. [Koepf / Binding 2016]
definition: Nischenartiger, meist offener oder nur durch einen Vorhang abgetrennter fensterloser Nebenraum eines Hauptraumes, der meist zur Aufstellung eines Bettes dient. [Schrader / Voigt 2003]
definition: ALKOVNA (arab. al kubbe = klenba, dutina), přístěnek bez oken, většinou jako místo na spaní. [Koch 2008] @cs
broader: Nische
created: 2020-08-03T09:59:48
preferred label: alkovna @cs
modified: 2021-01-27T01:27:02

Quellennachweis Koepf / Binding 2016
type: NamedIndividual
type: ConceptScheme

Nische
preferred label: výklenek @cs
preferred label: niche @fr
preferred label: nicho @es
preferred label: nicchia @it
type: NamedIndividual
type: Concept
narrower: Alkoven

Quellennachweis Schrader / Voigt 2003
type: NamedIndividual
type: ConceptScheme

Strukturtypen
type: NamedIndividual
type: ConceptScheme

Strukturtypen für Wohn- und Nutzbauten
type: NamedIndividual
type: ConceptScheme

Quellennachweis Koch 2008
type: NamedIndividual
type: ConceptScheme

Bamberger Vokabular für Historische Architektur
type: NamedIndividual
type: ConceptScheme