Quellennachweis Koch 2009
type: NamedIndividual
type: ConceptScheme

Textilie
preferred label: textilie @cs
type: NamedIndividual
type: Concept
narrower: Draperie (Textilie)

Quellennachweis Koepf / Binding 2016
type: NamedIndividual
type: ConceptScheme

Strukturtypen
type: NamedIndividual
type: ConceptScheme

Draperie (Textilie)
type: Concept
type: NamedIndividual
modified: 2020-09-01T12:06:16
created: 2020-08-04T12:40:00
in scheme: Quellennachweis Koepf / Binding 2016
in scheme: Bamberger Vokabular für Historische Architektur
in scheme: Quellennachweis Koch 2008
in scheme: Quellennachweis Koch 2009
in scheme: Strukturtypen
preferred label: draperie @cs
definition: Působivé uspořádání látek a rouch na plastikách a obrazech; k jejich přípravě sloužily oděvní studie. [Koch 2008] @cs
definition: Dekorativer loser Stoffbehang für Fenster, Tür, Altar, Bühne, Wand. [Koch 2009]
definition: Draperie (frz.), dekorative Stoffbehänge, bereits in der Antike zur Ausschmückung von kultischen und profanen Innenräumen benutzt, in frühchristl. und ma. Zeit an Altären und Kirchenwänden verwendet, erlangte die D. in den Fest- und Theaterdekorationen des 17./18. Jhs. große Bedeutung, schließl. aus Frankreich kommend als Innendekoration (u.a. Fenstervorhänge) und bei Möbeln bis Ende 18. Jh.; Ende des 19. Jhs. als Portiere wiederaufgenommen. [Koepf / Binding 2016]
broader: Textilie

Quellennachweis Koch 2008
type: NamedIndividual
type: ConceptScheme

Bamberger Vokabular für Historische Architektur
type: NamedIndividual
type: ConceptScheme