Altarretabelelement
type: NamedIndividual
type: Concept
narrower: Altarschrein

Quellennachweis Gliesmann 2011
type: NamedIndividual
type: ConceptScheme

Quellennachweis Koepf / Binding 2016
type: NamedIndividual
type: ConceptScheme

Altarschreinelement
type: NamedIndividual
type: Concept
related: Altarschrein

Strukturtypen
type: NamedIndividual
type: ConceptScheme

Strukturtypen für Sakralbauten
type: NamedIndividual
type: ConceptScheme

Corpus
preferred label: korpus @cs
type: NamedIndividual
type: Concept
related: Altarschrein

Quellennachweis Koch 2008
type: NamedIndividual
type: ConceptScheme

Altarschrein
created: 2020-02-26T17:07:03
in scheme: Quellennachweis Gliesmann 2011
in scheme: Quellennachweis Koepf / Binding 2016
in scheme: Strukturtypen
in scheme: Bamberger Vokabular für Historische Architektur
in scheme: Strukturtypen für Sakralbauten
in scheme: Quellennachweis Koch 2008
preferred label: scrigno @it
preferred label: relicario @es
preferred label: shrine @en
preferred label: oltářní skříň @cs
preferred label: écrin @fr
related: Corpus
related: Altarschreinelement
scope note: Skříň má na pravé i na levé straně křídla. Skříň, křídla a většinou i predela bývaly vybaveny řezbami (vyřezávaný oltář) nebo malbami. [Koch 2008] @cs
scope note: Hölzerner Behälter. Der Begriff wird vornehml. für bestimmte Behälter (Reliquiens., Heiligens., Kastenaltar), v. a. aber für den s.artigen Mittelteil eines Flügelaltars verwandt. [Koepf / Binding 2016]
scope note: Hölzerner, kastenförmiger Mittelteil eines Flügelaltars. [Koepf / Binding 2016]
scope note: Zentraler Teil des Flügelretabels. Gliedert sich von unten nach oben in Fries, Gefach mit als Schnitzereien ausgeführten szenischen Darstellungen und Maßwerk. Größere Retabel können mehrere Gefache enthalten, die in verschiedene Register aufgegliedert sind. [Gliesmann 2011]
broader: Altarretabelelement
alternative label: châsse @fr
alternative label: schránka @cs
alternative label: Schrein
alternative label: Kasten
alternative label: skříň (zast.) @cs
type: Concept
type: NamedIndividual
modified: 2021-01-31T00:03:11

Bamberger Vokabular für Historische Architektur
type: NamedIndividual
type: ConceptScheme