Quellennachweis Koch 2009
type: NamedIndividual
type: ConceptScheme

Quellennachweis Koepf / Binding 2016
type: NamedIndividual
type: ConceptScheme

architektonisches Zierelement
preferred label: výzdoba @cs
type: NamedIndividual
type: Concept
narrower: Ädikula

Gebäudeteil des Tempels
preferred label: část chrámu @cs
type: NamedIndividual
type: Concept
narrower: Ädikula

Quellennachweis Schrader / Voigt 2003
type: NamedIndividual
type: ConceptScheme

Strukturtypen
type: NamedIndividual
type: ConceptScheme

Strukturtypen für Sakralbauten
type: NamedIndividual
type: ConceptScheme

Quellennachweis Koch 2008
type: NamedIndividual
type: ConceptScheme

Bamberger Vokabular für Historische Architektur
type: NamedIndividual
type: ConceptScheme

Privatkapelle
preferred label: soukromá kaple @cs
type: NamedIndividual
type: Concept
related: Ädikula

Ädikula
definition: Giebelförmige Rahmung von Nischen, Portalen und Fenstern als architektonischer Schmuck und zur Gliederung großer Mauerflächen. Ursprung in der Antike, lat. kleines Haus oder Tempelchen, das zum Aufstellen von Statuen diente. [Schrader / Voigt 2003]
definition: EDIKULA (lat. domeček, míněn je dům boží), mnohostranný význam. 1. Malá nástavba v římských chrámech k umístění sochy. 2. V raně křesťanské době hrobka. 3. Ve středověku soukromá kaple. 4. Dnes všeobecně malá otevřená stavba (se štítem) malé hloubky nesená podporami a zadní stranou přiléhající ke zdi. [Koch 2008] @cs
definition: Ädikula (lat. Häuschen, gemeint ist Haus Gottes), vielseitig gebrauchte Bez. 1. für einen kleinen Aufbau in römischen Tempeln zur Aufstellung einer Statue; 2. in christlicher Frühzeit für ein Grabgebäude; 3. im Mittelalter für Privatkapelle; 4. heute allg. für ein kleines offenes (Giebel-)Gebäude von geringer Tiefe, das von Stützen getragen und mit der Rückseite an eine Wand gebaut ist; 5. Altar. [Koch 2009]
definition: Aedicula (lat. kleines Haus, Tempelchen), urspr. kleiner, einer Tempelfront ähnl. Aufbau zur Einstellung einer Statue. Danach jede aus Stützgliedern (Säulen, Pfeilern, Pilastern) mit Gebälk oder Bogen und einem Giebel in Dreieck oder Segmentbogenform bestehende Umrahmung von Nischen, Portalen und Fenstern als architekton. Schmuck und Belebung und Gliederung großer Mauerflächen am Außenbau und im Innenraum. [Koepf / Binding 2016]
preferred label: edikula @cs
preferred label: édicule @fr
preferred label: aedicula @en
in scheme: Bamberger Vokabular für Historische Architektur
in scheme: Quellennachweis Koch 2008
in scheme: Strukturtypen für Sakralbauten
in scheme: Quellennachweis Koepf / Binding 2016
in scheme: Quellennachweis Schrader / Voigt 2003
in scheme: Quellennachweis Koch 2009
in scheme: Strukturtypen
related: Privatkapelle
type: NamedIndividual
type: Concept
broader: Gebäudeteil des Tempels
broader: architektonisches Zierelement
modified: 2021-01-26T11:14:13
created: 2020-01-17T16:03:53
alternative label: Aedikula