Teneberleuchter
definition: Für die Karwoche; schmiedeeiserner Fuß mit dreieckigem oder dreiteiligem Aufsatz, im späten Mittelalter mit 12-15 Lichtern, je eines für Christus, die Apostel und manchmal die 3 Marien. [Koch 2009]
definition: Tenebraeleuchter m (lat. tenebrae "Finsternis"); auch Mettenleuchter m; Teneberleuchter m; Triangel f; lat. hersia triangularis; candelabrum triangulare; tenebrae candelabrum: ein dreieckiger Leuchter mit hohem Schaft. Er wird an der Epistelseite des Altares aufgestellt und nur an des letzten drei Tagen der Karwoche benützt. Er trägt 15 (oder nur 13) Kerzen, welche die elf Apostel, die drei Marien (oder nur die Mutter Gottes) und Christus symbolisieren. [Glossarium Artis]
definition: Svícen pro velikonoční týden; kovaná noha s trojúhelníkovým nebo trojdílným nástavcem, v pozdním středověku s 12 -15 světly, po jednom za Krista, apoštoly, a někdy za tři Marie. [Koch 2008] @cs
alternative label: Tenebraeleuchter
alternative label: herse à cierges @fr
alternative label: chandelier des ténèbres @fr
alternative label: chandelier triangulaire @fr
alternative label: Triangel
alternative label: Mettenleuchter
alternative label: Tenebrae-Candelabra @en
alternative label: tenebrae candelabrum @la
alternative label: candelabrum triangulare @la
preferred label: herse @fr
preferred label: hearse @en
preferred label: hersia triangularis @la
preferred label: velikonoční svícen @cs
type: Concept
type: NamedIndividual
in scheme: Bamberger Vokabular für Historische Architektur
in scheme: Quellennachweis Glossarium Artis
in scheme: Quellennachweis Koch 2008
in scheme: Strukturtypen
in scheme: Strukturtypen für Sakralbauten
broader: Standleuchter
modified: 2021-01-30T22:51:30
created: 2020-08-04T14:17:30

Strukturtypen
type: NamedIndividual
type: ConceptScheme

Standleuchter
preferred label: standard candlestick @en
preferred label: chandelier à pied @fr
type: NamedIndividual
type: Concept
narrower: Teneberleuchter

Strukturtypen für Sakralbauten
type: NamedIndividual
type: ConceptScheme

Quellennachweis Glossarium Artis
type: NamedIndividual
type: ConceptScheme

Quellennachweis Koch 2008
type: NamedIndividual
type: ConceptScheme

Bamberger Vokabular für Historische Architektur
type: NamedIndividual
type: ConceptScheme