Quellennachweis Koch 2009
type: NamedIndividual
type: ConceptScheme

Quellennachweis Koepf / Binding 2016
type: NamedIndividual
type: ConceptScheme

Strukturtypen
type: NamedIndividual
type: ConceptScheme

Strukturtypen für Sakralbauten
type: NamedIndividual
type: ConceptScheme

Strukturtypen für Wohn- und Nutzbauten
type: NamedIndividual
type: ConceptScheme

Quellennachweis Koch 2008
type: NamedIndividual
type: ConceptScheme

Zentralbau
preferred label: ouvrage à plan central @fr
preferred label: costruzione a pianta centrale @it
preferred label: construcción de plano central @es
preferred label: centrální stavba @cs
preferred label: central plan @en
type: NamedIndividual
type: Concept
narrower: Oktogon (Gebäude)

Bamberger Vokabular für Historische Architektur
type: NamedIndividual
type: ConceptScheme

Achteck
preferred label: oktogon @cs
type: NamedIndividual
type: Concept
related: Oktogon (Gebäude)

Oktogon (Gebäude)
definition: Oktogon (griech. Achteck), Bauwerk, das über einem regelmäßigen Achteck errichtet ist. Altorientalisch-antikes Symbol für die Vollendung des Kosmos (Athen, Turm der Winde; Spalato, Mausoleum; Albenga, Baptisterium; Aachen, Pfalzkapelle; Castel del Monte). [Koch 2009]
definition: Řec. osmiúhelník. Objekt s půdorysem ve tvaru pravidelného osmiúhelníku, staroorientální a antický symbol dokonalosti kosmu: Atény, Věž větrů; Split, mauzoleum; Albenga, baptisterium; Cáchy, palácová kaple; Castel del Monte. [Koch 2008] @cs
definition: Zentralbau über dem Grundriss eines regelmäßigen Achtecks. [Koepf/Binding 2016]
definition: Das regelmäßige A. (gr. Oktogon) ist eine wichtige geometr. Figur und wurde bei Zentralbauten als Grundrissfigur verwendet. [Koepf / Binding 2016]
broader: Zentralbau
preferred label: octogone @fr
preferred label: octógono @es
preferred label: oktogon (stavba) @cs
preferred label: octagon @en
preferred label: ottagono @it
created: 2020-08-18T12:36:04
modified: 2021-01-27T14:21:45
in scheme: Quellennachweis Koepf / Binding 2016
in scheme: Strukturtypen
in scheme: Bamberger Vokabular für Historische Architektur
in scheme: Strukturtypen für Sakralbauten
in scheme: Strukturtypen für Wohn- und Nutzbauten
in scheme: Quellennachweis Koch 2009
in scheme: Quellennachweis Koch 2008
related: Achteck
type: NamedIndividual
type: Concept