Quellennachweis Koch 2009
type: NamedIndividual
type: ConceptScheme

Quellennachweis Koepf / Binding 2016
type: NamedIndividual
type: ConceptScheme

Strukturtypen für Burgen und Schlösser
type: NamedIndividual
type: ConceptScheme

Palisade
definition: Schutzwand aus Pfählen. [Koch 2009]
definition: (frz. palissade ›Pfahlwerk‹) Einfachste, hölzerne Form der Brustwehr, schon in der Vorgeschichte gebräuchlich. Gelegentlich zu ebener Erde, meist aber auf einem Wall, wurden senkrechte (Rund-)Hölzer lückenlos nebeneinandergesetzt. Eine größere Schutzfunktion wurde durch die Kombination mit einem vorgelagerten Graben erreicht. Im Mittelalter konnten hölzerne P.n durchaus auch Zinnen aufweisen. Im Hochmittelalter wurden ältere P.n-Konstruktionen zuweilen durch steinerne Mauern ersetzt. R. F. [Wörterbuch der Burgen, Schlösser und Festungen]
definition: Lat.-franc., obranná hradba z kůlů. [Koch 2008] @cs
definition: Befestigung aus nebeneinander eingeschlagenen Pfählen (Schanzpfahlreihe), die oben zugespitzt sind. Schon bei röm. Standlagern, Fliehburgen, Motten usw. verwandt und dann bei ma. Burgen und Stadtbefestigungen längs der Böschungsoberkante der Umwallung angebracht. [Koepf/Binding 2016]
created: 2020-07-28T09:18:07
broader: Wehr- und Schutzanlage
preferred label: palisáda @cs
modified: 2021-01-27T12:19:57
in scheme: Quellennachweis Wörterbuch der Burgen, Schlösser und Festungen
in scheme: Bamberger Vokabular für Historische Architektur
in scheme: Strukturtypen
in scheme: Quellennachweis Koch 2008
in scheme: Quellennachweis Koepf / Binding 2016
in scheme: Strukturtypen für Burgen und Schlösser
in scheme: Quellennachweis Koch 2009
alternative label: palisádová stěna @cs
type: Concept
type: NamedIndividual

Strukturtypen
type: NamedIndividual
type: ConceptScheme

Quellennachweis Koch 2008
type: NamedIndividual
type: ConceptScheme

Quellennachweis Wörterbuch der Burgen, Schlösser und Festungen
type: NamedIndividual
type: ConceptScheme

Bamberger Vokabular für Historische Architektur
type: NamedIndividual
type: ConceptScheme

Wehr- und Schutzanlage
preferred label: opevnění @cs
type: NamedIndividual
type: Concept
narrower: Palisade