Quellennachweis Koepf / Binding 2016
type: NamedIndividual
type: ConceptScheme

Futtermauer
in scheme: Bamberger Vokabular für Historische Architektur
in scheme: Quellennachweis Glossarium Artis
in scheme: Strukturtypen
in scheme: Quellennachweis Koepf / Binding 2016
broader: Mauer
created: 2019-05-07T12:05:27
definition: Futtermauer, gemauerte Bekleidung, z.B. einer Böschung, zum Schutz gegen das Abstürzen von Felsmassen, im Unterschied zur Stützmauer gegen Erdmassen. [Koepf / Binding 2016]
definition: Schutzmauer vor Felskörpern, die der Verwitterung ausgesetzt sind, auch zur senkrechten Verkleidung von Erdtrassierungsstufen. Im Unterschied zur Stützmauer ist sie keinem seitlichen Druck ausgesetzt. (Glossarium Artis, Bd. 3, Bögen und Mauerwerk)
modified: 2021-01-22T15:36:53
type: Concept
type: NamedIndividual

Mauer
narrower: Futtermauer
type: NamedIndividual
type: Concept
preferred label: mur @fr
preferred label: muro @it
preferred label: murus @la
preferred label: zeď @cs
preferred label: wall @en

Strukturtypen
type: NamedIndividual
type: ConceptScheme

Quellennachweis Glossarium Artis
type: NamedIndividual
type: ConceptScheme

Bamberger Vokabular für Historische Architektur
type: NamedIndividual
type: ConceptScheme