Quellennachweis Koch 2009
type: NamedIndividual
type: ConceptScheme

Quellennachweis Koepf / Binding 2016
type: NamedIndividual
type: ConceptScheme

Strukturtypen
type: NamedIndividual
type: ConceptScheme

Bamberger Vokabular für Historische Architektur
type: NamedIndividual
type: ConceptScheme

Fries
preferred label: vlys @cs
preferred label: friso @es
preferred label: frise @fr
preferred label: frieze @en
preferred label: fregio @it
type: NamedIndividual
type: Concept
narrower: Mäander

Mäander
preferred label: meander @en
preferred label: bande à la grecque @fr
preferred label: meandr @cs
preferred label: meandro @it
alternative label: Greek key @en
alternative label: méandre @fr
type: NamedIndividual
type: Concept
created: 2019-05-16T16:03:30
in scheme: Quellennachweis Koepf / Binding 2016
in scheme: Bamberger Vokabular für Historische Architektur
in scheme: Strukturtypen
in scheme: Quellennachweis Koch 2009
definition: Wellenband, nach dem vielfach gewundenen Fluss Maiandros in Kleinasien benannter Ornament-Fries. [Koch 2009]
definition: Mäander (gr. nach dem vielgewundenen kleinasiat. Fluss Maiandros), fortlaufendes Ornament mit rechtwinkliger Richtungsänderung. Der M. ist hauptsächl. Bestandteil antiker Friese. Falls die Höhenteilung zwischen den waagerechten Linien eine gerade Zahl von Zwischenräumen ergibt, spricht man von einem att., bei ungerader Zahl von einem kleinasiat. M. Eine kurvierte Sonderform des M.s ist der Laufende Hund. [Koepf / Binding 2016]
broader: Fries
modified: 2021-01-25T12:07:01