Sturzbogen
preferred label: záklenek @cs
preferred label: arco ribassato (di porta o di finestra) @it
preferred label: vaulted lintel @en
preferred label: plate-bande bombée @fr
preferred label: arco achatado @es
alternative label: Horizontalbogen
alternative label: flat arch @en
alternative label: linteau échancré @fr
alternative label: arc en plate-bande @fr
alternative label: piattabanda @it
alternative label: scheitrechter Bogen
alternative label: dintel escotado @es
alternative label: dintel plano @es
alternative label: scheitrechter Sturz
alternative label: lintel @en
alternative label: arc monolithique arasé @fr
in scheme: Strukturtypen
in scheme: Quellennachweis Glossarium Artis
in scheme: Bamberger Vokabular für Historische Architektur
definition: Segmentbogenförmiger Abschluss einer Fenster- oder Türöffnung, missverständl. auch für einen Scheitrechten Sturz. [Koepf / Binding 2016]
definition: Scheitrechter Bogen, Sturzbogen, Horizontalbogen; trotz waagerechter Untersicht ein echter Bogen, d. h. die Fugen weisen zu einem angenommenen gemeinsamen Mittelpunkt. Der Setzung des Mauerwerks wird bei der Konstruktion des S.S.es durch eine geringfügige Erhöhung der Mitte oder durch Anordnung eines Entlastungsbogens entgegengewirkt. Ist der S. S. aus Werksteinen gefügt, so können zur Verbesserung der Tragfähigkeit auch Hakensteine verwendet werden. [Koepf / Binding 2016]
definition: Bogenförmige Überdeckung einer Fenster- oder Türöffnung durch einen Stein mit gerundeter Unterseite. Ausnahmsweise auch ein gerader Sturz mit ausgerundeter Oberseite. [Glossarium Artis]
broader: Sturz
broader: unechter Bogen
type: Concept
type: NamedIndividual
created: 2019-10-21T14:01:03
modified: 2021-01-22T16:36:22

Sturz
preferred label: lintel @en
preferred label: linteau @fr
preferred label: dintel @es
preferred label: architrave @it
type: NamedIndividual
type: Concept
narrower: Sturzbogen

Strukturtypen
type: NamedIndividual
type: ConceptScheme

unechter Bogen
preferred label: pseudoarco @it
preferred label: faux-arc @fr
preferred label: false arch @en
preferred label: arco falso @es
type: NamedIndividual
type: Concept
narrower: Sturzbogen

Quellennachweis Glossarium Artis
type: NamedIndividual
type: ConceptScheme

Bamberger Vokabular für Historische Architektur
type: NamedIndividual
type: ConceptScheme