Zyklopenmauerwerk
preferred label: cyclopean masonry @en
preferred label: mampostería ciclópea. @es
preferred label: kyklopské zdivo @cs
preferred label: maçonnerie cyclopéenne @fr
preferred label: mura ciclopiche @it
definition: Ein aus bes. großen, unregelmäßigen, manchmal aber sehr gut gefügten Natursteinen bestehendes Mauerwerk. Z. kommt hauptsächl. in der myken. Epoche, bei den Hethitern und bei Inkabauten vor. [Koepf / Binding 2016]
definition: Mauerwerk aus besonders großen, unregelmäßig geformten, nur grob bearbeiteten Bruch-steinblöcken. In größere Zwischenräume zwischen den Steinen werden Zwicker eingefügt, um die Stabilität zu sichern. Archäologen unterscheiden u.a. den tyrrhenischen, japygischen und mykenischen Verband, die Prähistoriker den megalithischen Verband. (Glossarium Artis, Bd. 3, Bögen und Mauerwerk)
definition: Mauerwerk, dessen Ansichtsfläche aus polygonalen Steinen besteht. [Koepf/Binding 2016]
in scheme: Bamberger Vokabular für Historische Architektur
in scheme: Strukturtypen
in scheme: Quellennachweis Glossarium Artis
in scheme: Quellennachweis Koepf / Binding 2016
alternative label: Kyklopenmauerwerk
alternative label: Netzmauerwerk
alternative label: mampostería poligonal @es
alternative label: pelasgické zdivo @cs
alternative label: pelasgisches Mauerwerk
alternative label: Polygonalmauerwerk
alternative label: maçonnerie polygonale @fr
alternative label: polygonální zdivo @cs
alternative label: opera poligonale @it
type: NamedIndividual
type: Concept
broader: Natursteinmauerwerk
modified: 2020-11-26T08:32:04
created: 2019-04-10T16:18:50

Quellennachweis Koepf / Binding 2016
type: NamedIndividual
type: ConceptScheme

Strukturtypen
type: NamedIndividual
type: ConceptScheme

Quellennachweis Glossarium Artis
type: NamedIndividual
type: ConceptScheme

Bamberger Vokabular für Historische Architektur
type: NamedIndividual
type: ConceptScheme

Natursteinmauerwerk
preferred label: zdivo z přírodního kamene @cs
preferred label: natural stone masonry @en
preferred label: Maçonnerie de pierres naturelles @fr
type: NamedIndividual
type: Concept
narrower: Zyklopenmauerwerk