Quellennachweis Koch 2009
type: NamedIndividual
type: ConceptScheme

Malereitechnik
preferred label: malířské techniky @cs
type: NamedIndividual
type: Concept
narrower: Fassmalerei

Begriffe für den Themenkomplex Sakralbau
type: NamedIndividual
type: ConceptScheme

Quellennachweis Koch 2008
type: NamedIndividual
type: ConceptScheme

Fassmalerei
in scheme: Quellennachweis Koch 2009
in scheme: Bamberger Vokabular für Historische Architektur
in scheme: Begriffe für den Themenkomplex Sakralbau
in scheme: Quellennachweis Koch 2008
type: NamedIndividual
type: Concept
preferred label: štafírování @cs
definition: Das farbige »Fassen« = Bemalen bzw. Vergolden von Stein- und Holzplastiken, um sie zu schmücken und zu konservieren. Das Holz wird vor dem Fassen mit Gips- oder Kreidegrundierung oder mit Leinwand überzogen, gelegentlich auch direkt mit Ölfarbe bemalt. Die Fassmalerei ist mit wenigen Ausnahmen (Riemenschneider!) bis zum Ende des Barocks allgemein üblich und der Beruf des Fassmalers entsprechend verbreitet. [Koch 2009]
definition: Pomalování, resp. pozlacení kamenných a dřevěných plastik sloužící jejich výzdobě a konzervaci; před malbou se dřevo potáhlo podkladem ze sádry nebo křídy, příp. plátnem, v některých případech Je přímo pomalováno olejovou barvou. Štafírování bylo až na výjimky zcela běžné až do konce baroka a povolání štafíře bylo velmi rozšířené. [Koch 2008] @cs
modified: 2021-01-18T13:59:24
created: 2020-08-05T09:34:19
broader: Malereitechnik

Bamberger Vokabular für Historische Architektur
type: NamedIndividual
type: ConceptScheme