Quellennachweis Koch 2009
type: NamedIndividual
type: ConceptScheme

Quellennachweis Koepf / Binding 2016
type: NamedIndividual
type: ConceptScheme

Antefix (Gebälk)
definition: Antefixa, Antefix (lat. die angenagelten Dinge), 1. bemalte Platten aus gebranntem Ton, mit denen an den frühen dor. Tempeln Großgriechenlands (Süditalien und Sizilien) und an etrusk. Tempeln das Gebälk unter dem Traufrand verkleidet war. Die Verwendung der A. wurde wahrscheinl. aus dem Holzbau übernommen, wo sie das Gebälk gegen Feuchtigkeit schützten (Antepagmenta). 2. Stirnziegel. [Koepf / Binding 2016]
definition: Antefix (lat. vorn befestigt), Mz. -a. 1. Stirnziegel; 2. bemalte Tonplatte, verkleidet das Gebälkunter dem Traufrand griechischer und etruskischer Tempel. [Koch 2009]
in scheme: Quellennachweis Koch 2009
in scheme: Strukturtypen
in scheme: Quellennachweis Koepf / Binding 2016
in scheme: Bamberger Vokabular für Historische Architektur
modified: 2020-09-02T10:17:53
type: NamedIndividual
type: Concept
broader: Gebälkelement
created: 2020-08-04T13:20:09

Strukturtypen
type: NamedIndividual
type: ConceptScheme

Gebälkelement
type: NamedIndividual
type: Concept
narrower: Antefix (Gebälk)

Bamberger Vokabular für Historische Architektur
type: NamedIndividual
type: ConceptScheme