Plandarstellung
type: NamedIndividual
type: Concept
narrower: Grundriss

Grundriss
modified: 2020-09-30T09:15:48
in scheme: Bamberger Vokabular für Historische Architektur
type: Concept
type: NamedIndividual
created: 2019-02-18T15:26:38
alternative label: horizontaler Schnitt
definition: Waagerechter Schnitt durch ein Bauwerk bzw. dessen Geschosse (Projektion) etwa in Brusthöhe. [Koepf / Binding 2016]
preferred label: půdorys @cs
broader: Plandarstellung

Bamberger Vokabular für Historische Architektur
type: NamedIndividual
type: ConceptScheme