Quellennachweis Koch 2009
type: NamedIndividual
type: ConceptScheme

Simon Petrus
preferred label: Petr @cs
type: NamedIndividual
type: Concept
related: Petruskreuz

Kreuzform
type: NamedIndividual
type: Concept
narrower: Petruskreuz

Petruskreuz
type: Concept
type: NamedIndividual
modified: 2021-01-22T19:01:18
in scheme: Bamberger Vokabular für Historische Architektur
in scheme: Quellennachweis Koch 2009
in scheme: Quellennachweis Koch 2008
created: 2020-07-06T11:30:06
alternative label: gestürztes Kreuz
broader by shape: Kreuzform
preferred label: croix de Saint-Pierre @fr
preferred label: St. Peter\'s cross @en
preferred label: svatopetrský kříž @cs
related: Simon Petrus
definition: Petrus-Kreuz, Petrus wurde kopfunter gekreuzigt. [Koch 2009]
definition: Petruskreuz n; auch gestürztes Kreuz n: ein lateinisches Kreuz, dessen Querbalken im unteren Drittel des Kreuzstammes liegt. Diese Kreuzform wird nur in Verbindung mit dem Martyrium des Apostels Petrus dargestellt, der seinem Wunsch gemäß kopfüber gekreuzigt worden war. [Glossarium Artis]
definition: Sv. Petr byl ukřižován hlavou dolů. [Koch 2008] @cs
broader: Kreuzform

Quellennachweis Koch 2008
type: NamedIndividual
type: ConceptScheme

Bamberger Vokabular für Historische Architektur
type: NamedIndividual
type: ConceptScheme